{"text_format":"1","workbook":"xlsx","n_sheets":6,"sheets":["T&E Cover ","Journals","DE+AT_corporate hospitality","DE+AT_business hospitality","Datos","Centros"],"not_rendered":{"charts":0,"images":1,"macros":1,"external_links":0,"defined_names":61,"comments":1,"pivot_tables":0},"unopened":[],"bounds":{"document_bytes":16777216,"sheet_cells":100000,"rows_first":2000,"rows_last":500,"rows_between":2000,"halvings":0,"cell_chars":16384,"cell_head_chars":4096},"cells_cut":0,"cells_raw":0,"read":"whole","date_system":"1900"}

{"sheet":"T&E Cover ","index":0,"n_rows":61,"n_cols":10,"rows_kept":61,"cut":false,"hidden":false,"merged":[[6,1,6,9],[54,3,54,5],[55,3,55,5],[56,3,56,5],[57,3,57,5],[49,3,49,5],[50,3,50,5],[51,3,51,5],[52,3,52,5],[53,3,53,5],[44,3,44,5],[45,3,45,5],[46,3,46,5],[47,3,47,5],[48,3,48,5],[39,3,39,5],[41,3,41,5],[42,3,42,5],[43,3,43,5],[34,3,34,5],[35,3,35,5],[36,3,36,5],[37,3,37,5],[38,3,38,5],[1,0,2,9],[21,3,21,5],[58,1,58,8],[22,3,22,5],[23,3,23,5],[24,3,24,5],[25,3,25,5],[26,3,26,5],[27,3,27,5],[28,3,28,5],[29,3,29,5],[30,3,30,5],[31,3,31,5],[32,3,32,5],[33,3,33,5],[40,3,40,5]]}
[null,null,null,null,null,null,null,null,null,"MD164-DBOCT2023"]
[]
[]
[]
[]
[null,"Travel Expenses Report",null,null,"Version: Jan 2024"]
[null,"To be flled in by the employee. All fields are mandatory. A receipt will be required per line on the expense report\nAll expenses reported must correspond to business travels previously approved according to the NHHG Travel Policy\nIs highly recommended that the employee inform to her/his responsible, before sending the template to the SSC to avoid further rejections\nIn Germany and Austria, employees must also fill in the mandatory tabs DE+AT_corporate hospitality and/or DE+AT_business hospitality when applicable\n(Journals Tag will be filled in by the SSC)"]
[]
[null,"Please. send this report and a pdf file with all attached support documentation to this email address",null,null,null,"TE_NH@digitalsharedservices.com"]
[null,"Team members with a nominative SAP User must report their travel expenses using TRIP transaction in SAP so only the rest of team members sould use this template"]
[null,"Center Type","Please select",null,"Employee Name"]
[null,"Business Unit","Please select",null,"Employee Number"]
[null,"Country","Please select",null,"Place /Destination"]
[null,"Hotel /Center","Please select",null,"Purpose/Reason"]
[null,"Company Code",{"$f":"IFERROR(VLOOKUP($C$14,Centros!B:N,5,FALSE),\"-\")","v":"-"},null,"Year"]
{"$rows_left_out":47}
{"sheet":"Journals","index":1,"n_rows":39,"n_cols":45,"rows_kept":39,"cut":false,"hidden":false,"merged":[]}
["BUKRS","BLART","BUDAT","BLDAT","XBLNR","WAERS","BKTXT","BUZEI","BSCHL","UMSKZ","KUNNR","LIFNR","HKONT","GSBER","KOSTL","WRBTR","ZUONR","SGTXT","XREF2","NEWBK","ZTERM","XREF1","LONG_TEXT","VBUND","PRCTR","VATDATE","XMWST","KURSF","WWERT","MWSKZ","AUFNR","SEGMENT","XREF3","ZLSCH","BVTYP","ZFBDT","HBKID","HKTID","WITHT","QSSKZ","QSSHB","VERTT ","VERTN","MATNR","WERKS"]
["Company Code (4)","Document Type (2)","Posting Date (8)","Document Date (8)","Reference (16)","Currency (3)","Doc. Header Text (25)","Position (3)","Posting Key (2)","SGL Ind (1)","Customer (10)","Vendor (10)","GL Account (10)","Business Area (4)","Cost Center (10)","Amount (13)","Assignment (18)","Text (50)","Reference Key  2 (12)","New Company Code (4)","Payment Terms (4)","Reference Key 1 (12)","Long Text (500)","Trading Partner (6)","Profit Center (6)","VAT Date (8)","Calculate Tax (1)","Rate (5dec)","Traslation Date (8)","Tax Code (2)","Order (12)","Segment (10)","Reference Key 3 (12)","Payment Method (2)","Part. Bank (4)","Bline date (8)","House Bank (5)","Account ID (5)","Withholding Tax Type ()","Withholding Tax Code (2)","Withholding Tax base amount (13)","Contract Type (1)","Contract (13)","Material (18)","Plant (4)"]
[{"$f":"'T&E Cover '!$C$15","v":"-"},"KU",{"$f":"TODAY()","v":"2024-01-17"},{"$f":"'T&E Cover '!$F$17","v":"00:00:00"},{"$f":"CONCATENATE(\"TRIP\",\" \",'T&E Cover '!$F$17)","v":"TRIP "},{"$f":"'T&E Cover '!$F$18","v":"-"},null,1,31,null,null,null,null,{"$f":"'T&E Cover '!$C$16","v":"-"},null,{"$f":"'T&E Cover '!J59","v":0},null,{"$f":"CONCATENATE(\"TRIP\",\" \",'T&E Cover '!$F$17)","v":"TRIP "}]
[{"$f":"'T&E Cover '!$C$15","v":"-"},"KU",{"$f":"TODAY()","v":"2024-01-17"},{"$f":"'T&E Cover '!$F$17","v":"00:00:00"},{"$f":"CONCATENATE(\"TRIP\",\" \",'T&E Cover '!$F$17)","v":"TRIP "},{"$f":"'T&E Cover '!$F$18","v":"-"},null,2,"40",null,null,null,62940000,{"$f":"'T&E Cover '!$C$16","v":"-"},{"$f":"'T&E Cover '!$C$19","v":""},{"$f":"'T&E Cover '!J23","v":0},null,{"$f":"CONCATENATE(\"TRIP\",\" \",'T&E Cover '!$F$17)","v":"TRIP "}]
[{"$f":"'T&E Cover '!$C$15","v":"-"},"KU","2024-01-17",{"$f":"'T&E Cover '!$F$17","v":"00:00:00"},{"$f":"CONCATENATE(\"TRIP\",\" \",'T&E Cover '!$F$17)","v":"TRIP "},{"$f":"'T&E Cover '!$F$18","v":"-"},null,3,"40",null,null,null,62940000,{"$f":"'T&E Cover '!$C$16","v":"-"},{"$f":"'T&E Cover '!$C$19","v":""},{"$f":"'T&E Cover '!J24","v":0},null,{"$f":"CONCATENATE(\"TRIP\",\" \",'T&E Cover '!$F$17)","v":"TRIP "}]
[{"$f":"'T&E Cover '!$C$15","v":"-"},"KU","2024-01-17",{"$f":"'T&E Cover '!$F$17","v":"00:00:00"},{"$f":"CONCATENATE(\"TRIP\",\" \",'T&E Cover '!$F$17)","v":"TRIP "},{"$f":"'T&E Cover '!$F$18","v":"-"},null,4,"40",null,null,null,62940000,{"$f":"'T&E Cover '!$C$16","v":"-"},{"$f":"'T&E Cover '!$C$19","v":""},{"$f":"'T&E Cover '!J25","v":0},null,{"$f":"CONCATENATE(\"TRIP\",\" \",'T&E Cover '!$F$17)","v":"TRIP "}]
[{"$f":"'T&E Cover '!$C$15","v":"-"},"KU","2024-01-17",{"$f":"'T&E Cover '!$F$17","v":"00:00:00"},{"$f":"CONCATENATE(\"TRIP\",\" \",'T&E Cover '!$F$17)","v":"TRIP "},{"$f":"'T&E Cover '!$F$18","v":"-"},null,5,"40",null,null,null,62940000,{"$f":"'T&E Cover '!$C$16","v":"-"},{"$f":"'T&E Cover '!$C$19","v":""},{"$f":"'T&E Cover '!J26","v":0},null,{"$f":"CONCATENATE(\"TRIP\",\" \",'T&E Cover '!$F$17)","v":"TRIP "}]
[{"$f":"'T&E Cover '!$C$15","v":"-"},"KU","2024-01-17",{"$f":"'T&E Cover '!$F$17","v":"00:00:00"},{"$f":"CONCATENATE(\"TRIP\",\" \",'T&E Cover '!$F$17)","v":"TRIP "},{"$f":"'T&E Cover '!$F$18","v":"-"},null,6,"40",null,null,null,62940000,{"$f":"'T&E Cover '!$C$16","v":"-"},{"$f":"'T&E Cover '!$C$19","v":""},{"$f":"'T&E Cover '!J27","v":0},null,{"$f":"CONCATENATE(\"TRIP\",\" \",'T&E Cover '!$F$17)","v":"TRIP "}]
[{"$f":"'T&E Cover '!$C$15","v":"-"},"KU","2024-01-17",{"$f":"'T&E Cover '!$F$17","v":"00:00:00"},{"$f":"CONCATENATE(\"TRIP\",\" \",'T&E Cover '!$F$17)","v":"TRIP "},{"$f":"'T&E Cover '!$F$18","v":"-"},null,7,"40",null,null,null,62940000,{"$f":"'T&E Cover '!$C$16","v":"-"},{"$f":"'T&E Cover '!$C$19","v":""},{"$f":"'T&E Cover '!J28","v":0},null,{"$f":"CONCATENATE(\"TRIP\",\" \",'T&E Cover '!$F$17)","v":"TRIP "}]
[{"$f":"'T&E Cover '!$C$15","v":"-"},"KU","2024-01-17",{"$f":"'T&E Cover '!$F$17","v":"00:00:00"},{"$f":"CONCATENATE(\"TRIP\",\" \",'T&E Cover '!$F$17)","v":"TRIP "},{"$f":"'T&E Cover '!$F$18","v":"-"},null,8,"40",null,null,null,62940000,{"$f":"'T&E Cover '!$C$16","v":"-"},{"$f":"'T&E Cover '!$C$19","v":""},{"$f":"'T&E Cover '!J29","v":0},null,{"$f":"CONCATENATE(\"TRIP\",\" \",'T&E Cover '!$F$17)","v":"TRIP "}]
[{"$f":"'T&E Cover '!$C$15","v":"-"},"KU","2024-01-17",{"$f":"'T&E Cover '!$F$17","v":"00:00:00"},{"$f":"CONCATENATE(\"TRIP\",\" \",'T&E Cover '!$F$17)","v":"TRIP "},{"$f":"'T&E Cover '!$F$18","v":"-"},null,9,"40",null,null,null,62940000,{"$f":"'T&E Cover '!$C$16","v":"-"},{"$f":"'T&E Cover '!$C$19","v":""},{"$f":"'T&E Cover '!J30","v":0},null,{"$f":"CONCATENATE(\"TRIP\",\" \",'T&E Cover '!$F$17)","v":"TRIP "}]
[{"$f":"'T&E Cover '!$C$15","v":"-"},"KU","2024-01-17",{"$f":"'T&E Cover '!$F$17","v":"00:00:00"},{"$f":"CONCATENATE(\"TRIP\",\" \",'T&E Cover '!$F$17)","v":"TRIP "},{"$f":"'T&E Cover '!$F$18","v":"-"},null,10,"40",null,null,null,62940000,{"$f":"'T&E Cover '!$C$16","v":"-"},{"$f":"'T&E Cover '!$C$19","v":""},{"$f":"'T&E Cover '!J31","v":0},null,{"$f":"CONCATENATE(\"TRIP\",\" \",'T&E Cover '!$F$17)","v":"TRIP "}]
[{"$f":"'T&E Cover '!$C$15","v":"-"},"KU","2024-01-17",{"$f":"'T&E Cover '!$F$17","v":"00:00:00"},{"$f":"CONCATENATE(\"TRIP\",\" \",'T&E Cover '!$F$17)","v":"TRIP "},{"$f":"'T&E Cover '!$F$18","v":"-"},null,11,"40",null,null,null,62940000,{"$f":"'T&E Cover '!$C$16","v":"-"},{"$f":"'T&E Cover '!$C$19","v":""},{"$f":"'T&E Cover '!J32","v":0},null,{"$f":"CONCATENATE(\"TRIP\",\" \",'T&E Cover '!$F$17)","v":"TRIP "}]
[{"$f":"'T&E Cover '!$C$15","v":"-"},"KU","2024-01-17",{"$f":"'T&E Cover '!$F$17","v":"00:00:00"},{"$f":"CONCATENATE(\"TRIP\",\" \",'T&E Cover '!$F$17)","v":"TRIP "},{"$f":"'T&E Cover '!$F$18","v":"-"},null,12,"40",null,null,null,62940000,{"$f":"'T&E Cover '!$C$16","v":"-"},{"$f":"'T&E Cover '!$C$19","v":""},{"$f":"'T&E Cover '!J33","v":0},null,{"$f":"CONCATENATE(\"TRIP\",\" \",'T&E Cover '!$F$17)","v":"TRIP "}]
[{"$f":"'T&E Cover '!$C$15","v":"-"},"KU","2024-01-17",{"$f":"'T&E Cover '!$F$17","v":"00:00:00"},{"$f":"CONCATENATE(\"TRIP\",\" \",'T&E Cover '!$F$17)","v":"TRIP "},{"$f":"'T&E Cover '!$F$18","v":"-"},null,13,"40",null,null,null,62940000,{"$f":"'T&E Cover '!$C$16","v":"-"},{"$f":"'T&E Cover '!$C$19","v":""},{"$f":"'T&E Cover '!J34","v":0},null,{"$f":"CONCATENATE(\"TRIP\",\" \",'T&E Cover '!$F$17)","v":"TRIP "}]
{"$rows_left_out":25}
{"sheet":"DE+AT_corporate hospitality","index":2,"n_rows":37,"n_cols":11,"rows_kept":37,"cut":false,"hidden":false,"merged":[[26,1,26,6],[34,1,34,2],[37,1,37,2],[37,3,37,4],[19,1,19,6],[20,1,20,6],[21,1,21,6],[23,1,23,6],[24,1,24,6],[25,1,25,6],[18,1,18,6],[7,1,7,2],[7,3,7,6],[9,1,9,6],[10,1,10,6],[11,1,11,6],[12,1,12,6],[13,1,13,6],[14,1,14,6],[15,1,15,6],[16,1,16,6],[17,1,17,6]]}
[]
[null,"Bewirtungsbeleg",null,null,null,null,null,null,null,null,"Bewirtungsbeleg - Originalbeleg hier aufkleben"]
[]
[null,"Angaben zum Nachweis der Höhe und der betrieblichen "]
[null,"Veranlassung von Bewirtungsaufwendungen ($4 Abs. 5 Nr. 2 EStG)"]
[]
[null,"Date of Service",null,"Location (genaue Bezeichnung)"]
[]
[null,"participants"]
[]
[]
[]
[]
[]
[]
{"$rows_left_out":23}
{"sheet":"DE+AT_business hospitality","index":3,"n_rows":37,"n_cols":11,"rows_kept":37,"cut":false,"hidden":false,"merged":[[26,1,26,6],[34,1,34,2],[37,1,37,2],[37,3,37,4],[19,1,19,6],[20,1,20,6],[21,1,21,6],[23,1,23,6],[24,1,24,6],[25,1,25,6],[18,1,18,6],[7,1,7,2],[7,3,7,6],[9,1,9,6],[10,1,10,6],[11,1,11,6],[12,1,12,6],[13,1,13,6],[14,1,14,6],[15,1,15,6],[16,1,16,6],[17,1,17,6]]}
[]
[null,"Bewirtungsbeleg",null,null,null,null,null,null,null,null,"Bewirtungsbeleg - Originalbeleg hier aufkleben"]
[]
[null,"Angaben zum Nachweis der Höhe und der geschäftlichen "]
[null,"Veranlassung von Bewirtungsaufwendungen ($4 Abs. 5 Nr. 2 EStG)"]
[]
[null,"Date of Service",null,"Location (genaue Bezeichnung)"]
[]
[null,"participants"]
[]
[]
[]
[]
[]
[]
{"$rows_left_out":23}
{"sheet":"Datos","index":4,"n_rows":166,"n_cols":45,"rows_kept":166,"cut":false,"hidden":true,"merged":[]}
[]
[null,null,"Type_of_expense","Type_of_Center","HEADQUARTERS","CENTRAL_SERVICES_BU","CS_SOUTHERN_EUROPE","CS_NORTHERN_EUROPE","CS_AMERICA",null,"HOTELS",null,"SOUTHERN_EUROPE","NORTHERN_EUROPE","AMERICA","ANDORRA","SPAIN","PORTUGAL","BELGIUM","FRANCE","LUXEMBOURG","NETHERLANDS","DENMARK","UK","USA","AUSTRIA","CZECH.RPC","GERMANY","HUNGARY","POLAND","ROMANIA","SLOVAKIA","SWITZERLAND","ITALY","ARGENTINA","CHILE",null,"HAITI","MEXICO","URUGUAY","COLOMBIA","ECUADOR","BRASIL","IRELAND","FINLAND"]
[null,null,"Please select","Please select","Please select","Please select","Please select","Please select","Please select",null,"Please select",null,"Please select","Please select","Please select","Please select","Please select","Please select","Please select","Please select","Please select","Please select","Please select","Please select","Please select","Please select","Please select","Please select","Please select","Please select","Please select","Please select","Please select","Please select","Please select","Please select",null,"Please select","Please select","Please select","Please select","Please select","Please select","Please select","Please select"]
[null,null,"CAR RENTAL","HEADQUARTERS","HQ","CS_AMERICA","CS_SPAIN","CS_NETHERLANDS","CS_ARGENTINA",null,"AMERICA",null,"ANDORRA","AUSTRIA","ARGENTINA","NH Andorra la Vella","Anantara Villa Padierna Palace Benahavís Marbella Resort","Anantara Vilamoura Algarve Resort","NH Brugge","Anantara Plaza Nice Hotel","NH Luxembourg","Anantara Grand Hotel Krasnapolsky Amsterdam","NH Collection Copenhagen","nhow London","NH Collection New York Madison Avenue","Anantara Palais Hansen Vienna","NH Collection Olomouc Congress","Avani Frankfurt City Hotel","Anantara New York Palace Budapest Hotel","NH Poznan","NH Timisoara","NH Bratislava Gate One","NH Bern The Bristol","Anantara Convento di Amalfi Grand Hotel","NH Collection Buenos Aires Crillon","NH Antofagasta",null,"NH Haiti El Rancho","Avani Cancún Airport","NH Montevideo Columbia","Avani Royal Zona T Bogota Hotel","NH Collection Quito Royal","NH Curitiba The Five","Anantara The Marker Dublin","NH Collection Helsinki Grand Hansa"]
[null,null,"HOTEL","CENTRAL_SERVICES_BU",null,"CS_NORTHERN_EUROPE","CS_ITALY","CS_GERMANY","CS_COLOMBIA",null,"NORTHERN_EUROPE",null,"FRANCE","BELGIUM","BRASIL","NH Collection Andorra Palomé","Avani Alonso Martinez Madrid Hotel","AVANI Avenida Liberdade Lisbon","NH Brussels Airport","NH Collection Marseille",null,"NH Amersfoort",null,null,null,"NH Collection Salzburg City","NH Collection Prague","NH Berlin Alexanderplatz","NH Budapest City",null,null,null,"NH Geneva Airport","Anantara Palazzo Naiadi Rome Hotel","NH Bariloche Edelweiss","NH Ciudad de Santiago",null,null,"Hilton Aeropuerto",null,"NH Bogotá Pavillon Royal"]
[null,null,"INVITATION","HOTELS","HQ","CS_SOUTHERN_EUROPE","CS_PORTUGAL","CS_AUSTRIA","CS_CHILE",null,"SOUTHERN_EUROPE",null,"ITALY","CZECH.RPC","COLOMBIA",null,"Casino de Madrid","NH Collection Lisboa Liberdade","NH Brussels Carrefour de l’Europe","NH Lyon Airport",null,"NH Amsterdam Caransa",null,null,null,"NH Collection Wien Zentrum","NH Collection Prague Carlo IV","NH Berlin City Ost","NH Collection Budapest City Center",null,null,null,"NH Geneva City","Avani Palazzo Moscova Milan Hotel","NH Buenos Aires 9 de Julio","NH Collection Plaza Santiago",null,null,"NH Coatzacoalcos",null,"NH Bogotá Urban 26 Royal"]
[null,null,"KM-MILEAGE",null,"Please select",null,"CS_FRANCE","CS_BELGIUM","CS_MEXICO",null,null,null,"PORTUGAL","DENMARK","CHILE",null,"Centro de Formación BBVA La Moraleja","NH Collection Porto Batalha","NH Brussels EU Berlaymont","NH Nice",null,"NH Amsterdam Leidseplein",null,null,null,"NH Danube City","NH Prague City","NH Berlin Kurfürstendamm",null,null,null,null,null,"Avani Rio Novo Venice Hotel","NH Buenos Aires City","NH Collection Santiago Casacostanera",null,null,"NH Collection Guadalajara Providencia",null,"NH Bogotá Urban 93 Royal"]
[null,null,"MEALS",null,"HQ_SPAIN",null,null,"CS_SWITZERLAND",null,null,null,null,"SPAIN","GERMANY","ECUADOR",null,"NH Alcorcon","NH Dona Ines Coimbra","NH Brussels Grand Place Arenberg","NH Paris Champs-Elysées",null,"NH Amsterdam Museum Quarter",null,null,null,"NH Graz City",null,"NH Berlin Potsdamer Platz",null,null,null,null,null,"NH Ancona","NH Buenos Aires Florida","NH Iquique",null,null,"NH Collection Mérida Paseo Montejo",null,"NH Cali Boulevard del Rio"]
[null,null,"OTHERS, MISCELLANEOUS",null,null,null,null,null,null,null,null,null,"USA","FINLAND","HAITI",null,"NH Alicante","NH Lisboa Campo Grande","NH Brussels Stéphanie","NH Paris Gare de l´Est",null,"NH Amsterdam Noord",null,null,null,"NH Vienna Airport Conference Center",null,"NH Bingen",null,null,null,null,null,"NH Bergamo","NH Buenos Aires Latino","NH Iquique Pacifico",null,null,"NH Collection Mexico City Airport T2",null,"NH Cali Royal"]
[null,null,"PARKING",null,null,null,null,null,null,null,null,null,null,"HUNGARY","MEXICO",null,"NH Avenida Jerez","NH Marina Portimão Resort","NH Collection Antwerp Centre","NH Paris Opéra Faubourg",null,"NH Amsterdam Schiller",null,null,null,"NH Wien Belvedere",null,"NH Collection Berlin Mitte am Checkpoint Charlie",null,null,null,null,null,"NH Bologna de la Gare","NH Buenos Aires Tango",null,null,null,"NH Collection Mexico City Centro Histórico",null,"NH Cartagena Urban Royal"]
[null,null,"PUBLIC TRANSPORT (BUS, SUBWAY)",null,null,null,null,null,null,null,null,null,null,"IRELAND","URUGUAY",null,"NH Barcelona Diagonal Center","NH Porto Jardim","NH Collection Brussels Centre","NH Toulouse Airport",null,"NH Amsterdam Schiphol Airport",null,null,null,"NH Wien City",null,"NH Collection Berlin Mitte Friedrichstrasse",null,null,null,null,null,"NH Bologna Villanova","NH Collection Buenos Aires Centro Histórico",null,null,null,"NH Collection Mexico City Reforma",null,"NH Collection Barranquilla Smartsuites Royal"]
[null,null,"TAXI",null,null,null,null,null,null,null,null,null,null,"LUXEMBOURG",null,null,"NH Barcelona Eixample","NH Sintra Centro","NH Collection Brussels Grand Sablon","nhow Marseille",null,"NH Amsterdam Zuid",null,null,null,null,null,"NH Collection Dresden Altmarkt",null,null,null,null,null,"NH Caltagirone Villa San Mauro","NH Collection Buenos Aires Jousten",null,null,null,"NH Collection Mexico City Santa Fe",null,"NH Collection Bogotá Andino Royal"]
[null,null,"TOLL",null,null,null,null,null,null,null,null,null,null,"NETHERLANDS",null,null,"NH Barcelona Entenza","The Residences at Victoria Algarve","NH Gent Belfort",null,null,"NH Arnhem Rijnhotel",null,null,null,null,null,"NH Collection Frankfurt Spin Tower",null,null,null,null,null,"NH Catania Centro","NH Collection Buenos Aires Lancaster",null,null,null,"NH Collection Monterrey San Pedro",null,"NH Collection Bogotá Hacienda Royal"]
[null,null,"TRAVEL TICKET (AIRPLAIN, TRAIN)",null,null,null,null,null,null,null,null,null,null,"POLAND",null,null,"NH Barcelona Les Corts","Tivoli Alvor Algarve - All Inclusive Resort","NH Mechelen",null,null,"NH Atlanta Rotterdam",null,null,null,null,null,"NH Collection Hamburg City",null,null,null,null,null,"NH Catania Parco Degli Aragonesi","NH Córdoba Panorama",null,null,null,"NH Mexico City Valle Dorado",null,"NH Collection Bogotá Teleport Royal"]
[null,null,null,null,null,null,null,null,null,null,null,null,null,"ROMANIA",null,null,"NH Barcelona Stadium","Tivoli Avenida Liberdade Lisboa","nhow Brussels Bloom",null,null,"NH Atlantic Den Haag",null,null,null,null,null,"NH Collection Heidelberg",null,null,null,null,null,"NH Collection Firenze Palazzo Gaddi","NH Córdoba Urbano",null,null,null,"NH Monterrey La Fe",null,"NH Collection Bogotá Terra 100 Royal"]
{"$rows_left_out":152}
{"sheet":"Centros","index":5,"n_rows":387,"n_cols":26,"rows_kept":387,"cut":false,"hidden":true,"merged":[]}
["CENTER CODE","HOTEL COMMERCIAL NAME","BUSINESS UNIT","Country","CITY","COMPANY CODE","COMPANY","CENTER","FI NAME","CUSTOMER SAP(CENTER)","FI NAME","BU NEW 2022","COUNTRY NAME","CURR","REGION","Contact 1-TO","Contact 2-CC","Contact 3-OTHER","Contact 4-OTHER",null,null,"GENERAL MANAGER NAME","TMS CENTER CODE (II)","GT","GT","SSC"]
["0002","NH Ciudad de Zaragoza","BU Southern Europe","Spain","Zaragoza","ES10","NH HOTELES ESPAÑA, S.A","0002","ES10 NH CIUDAD DE ZARAGOZA",9900000002,"ES10 NH CIUDAD DE ZARAGOZA","BUSE","SPAIN","EUR","Mónica Alcoriza","bp.millan@nh-hotels.com"," ",null,null,null,null,"Carmen Cenzano","ESZZ.CIUZA","GT01","G","Y"]
["0004","NH Collection Gran Hotel de Zaragoza","BU Southern Europe","Spain","Zaragoza","ES10","NH HOTELES ESPAÑA, S.A","0004","ES10 NH COLLECTION GRAN HOTEL",9900000004,"ES10 NH COLLECTION GRAN HOTEL","BUSE","SPAIN","EUR","Mónica Alcoriza","bp.millan@nh-hotels.com"," ",null,null,null,null,"Patricia Val Usón","ESZZ.GRAHO","GT01","G","Y"]
["0005","NH Canciller Ayala Vitoria","BU Southern Europe","Spain","Vitoria","ES10","NH HOTELES ESPAÑA, S.A","0005","ES10NH CANCILLER AYALA VITORIA",9900000005,"ES10NH CANCILLER AYALA VITORIA","BUSE","SPAIN","EUR","Raúl Fernández","mi.gonzalez@nh-hotels.com"," ",null,null,null,null,"Gema Guillerna Monasterio","ESVI.CANAY","GT01","G","Y"]
["0010","Avani Alonso Martinez Madrid Hotel","BU Southern Europe","Spain","Madrid","ES10","NH HOTELES ESPAÑA, S.A","0010","ES10 AVANI ALONSO MARTINEZ",9900000010,"ES10 AVANI ALONSO MARTINEZ","BUSE","SPAIN","EUR","José Ángel Esteban","m.ramirez.intern@nh-hotels.com"," ",null,null,null,null,"María García Valdehíta","ESMD.EMBAJ","GT01","G","Y"]
["0012","NH Madrid Ventas","BU Southern Europe","Spain","Madrid","ES10","NH HOTELES ESPAÑA, S.A","0012","ES10 NH VENTAS",9900000012,"ES10 NH VENTAS","BUSE","SPAIN","EUR","José Ángel Esteban","m.ramirez.intern@nh-hotels.com"," ",null,null,null,null,"Guillermo Mesas","ESMD.PARAV","GT01","G","Y"]
["0014","NH Sevilla Plaza de Armas","BU Southern Europe","Spain","Seville","ES01","NH HOTEL GROUP, S.A","0014","ES01 NH PLAZA DE ARMAS",9900000014,"ES01 NH PLAZA DE ARMAS","BUSE","SPAIN","EUR","Mariví Motilva","m.ramirez.intern@nh-hotels.com"," ",null,null,null,null,"Andrés Castillo Álvarez","ESSE.ARMAS","GT01","G","Y"]
["0017","NH Valencia Center","BU Southern Europe","Spain","Valencia","ES10","NH HOTELES ESPAÑA, S.A","0017","ES10 NH CENTER",9900000017,"ES10 NH CENTER","BUSE","SPAIN","EUR","Mónica Alcoriza","bp.millan@nh-hotels.com"," ",null,null,null,null,"Ricardo López Sarasa","ESVL.CENTE","GT01","G","Y"]
["0018","NH Collection Madrid Abascal ","BU Southern Europe","Spain","Madrid","ES10","NH HOTELES ESPAÑA, S.A","0018","ES10 NH COLLECTION ABASCAL",9900000018,"ES10 NH COLLECTION ABASCAL","BUSE","SPAIN","EUR","José Ángel Esteban","m.ramirez.intern@nh-hotels.com"," ",null,null,null,null,"Concepción Bedoya","ESMD.ABASC","GT01","G","Y"]
["0019","NH Madrid Nacional","BU Southern Europe","Spain","Madrid","ES01","NH HOTEL GROUP, S.A","0019","ES01 NH NACIONAL",9900000019,"ES01 NH NACIONAL","BUSE","SPAIN","EUR","José Ángel Esteban","m.ramirez.intern@nh-hotels.com"," ",null,null,null,null,"Ignacio Lendines","ESMD.NACIO","GT01","G","Y"]
["0027","NH Valencia Las Artes","BU Southern Europe","Spain","Valencia","ES10","NH HOTELES ESPAÑA, S.A","0027","ES10 NH LAS ARTES",9900000027,"ES10 NH LAS ARTES","BUSE","SPAIN","EUR","Mónica Alcoriza","bp.millan@nh-hotels.com"," ",null,null,null,null,"Julio Krebs Muñoz","ESVL.ARTE1","GT01","G","Y"]
["0028","NH Valencia Las Ciencias","BU Southern Europe","Spain","Valencia","ES10","NH HOTELES ESPAÑA, S.A","0028","ES10 NH LAS CIENCIAS",9900000028,"ES10 NH LAS CIENCIAS","BUSE","SPAIN","EUR","Mónica Alcoriza","bp.millan@nh-hotels.com"," ",null,null,null,null,"Julio Krebs Muñoz","ESVL.ARTE2","GT01","G","Y"]
["0032","NH Córdoba Califa","BU Southern Europe","Spain","Cordoba (ES)","ES55","ATLANTA SOLUTIONS, S.L.","0032","ES55 NH CALIFA",9900000032,"ES55 NH CALIFA","BUSE","SPAIN","EUR","Mariví Motilva","m.ramirez.intern@nh-hotels.com"," ",null,null,null,null,"Amparo García Sánchez","ESCO.CALIF","GT01","G","N"]
["0035","NH Collection Sevilla ","BU Southern Europe","Spain","Seville","ES10","NH HOTELES ESPAÑA, S.A","0035","ES10 NH COLLECTION SEVILLA",9900000035,"ES10 NH COLLECTION SEVILLA","BUSE","SPAIN","EUR","Mariví Motilva","m.ramirez.intern@nh-hotels.com"," ",null,null,null,null,"Nacho Ansó","ESSE.CECON","GT01","G","Y"]
["0041","NH Barcelona Eixample","BU Southern Europe","Spain","Barcelona","ES10","NH HOTELES ESPAÑA, S.A","0041","ES10 NH EIXAMPLE",9900000041,"ES10 NH EIXAMPLE","BUSE","SPAIN","EUR","Mónica Alcoriza","bp.millan@nh-hotels.com"," ",null,null,null,null,"David Illa","ESBA.MASTE","GT01","G","Y"]
{"$rows_left_out":372}