{"text_format":"1","workbook":"xlsx","n_sheets":6,"sheets":["Respuestas del CSC","Hoja automatica","Listados opciones selecc","Listados","Traducciones","Respuestas al CSC"],"not_rendered":{"charts":0,"images":0,"macros":1,"external_links":0,"defined_names":1,"comments":0,"pivot_tables":0},"unopened":[],"bounds":{"document_bytes":16777216,"sheet_cells":100000,"rows_first":2000,"rows_last":500,"rows_between":2000,"halvings":0,"cell_chars":16384,"cell_head_chars":4096},"cells_cut":0,"cells_raw":0,"read":"whole","date_system":"1900"}

{"sheet":"Respuestas del CSC","index":0,"n_rows":79,"n_cols":19,"rows_kept":79,"cut":false,"hidden":true,"merged":[[24,9,27,9],[24,10,27,10],[24,12,27,12],[28,11,30,11],[24,8,34,8],[31,12,34,12],[33,14,34,14],[31,15,32,15],[24,0,34,0],[28,9,34,9],[24,3,34,3],[28,10,34,10],[24,6,34,6],[24,4,34,4],[28,12,30,12],[31,11,34,11],[31,13,32,13],[33,13,34,13],[2,6,4,6],[2,8,4,8],[14,7,15,7],[5,10,6,10],[14,6,18,6],[17,10,18,10],[2,10,4,10],[9,10,10,10],[9,6,10,6],[7,7,8,7],[5,7,6,7],[5,6,8,6],[7,10,8,10],[5,8,6,8],[9,8,10,8],[7,8,8,8],[17,7,18,7],[17,8,18,8],[14,8,15,8],[2,4,10,4],[2,5,4,5],[21,3,22,3],[21,4,22,4],[13,4,20,4],[5,5,8,5],[2,0,11,0],[13,0,21,0],[2,3,10,3],[13,3,20,3],[21,1,22,1],[21,2,22,2],[14,5,18,5],[36,12,37,12],[38,9,39,9],[38,10,39,10],[38,12,39,12],[40,9,41,9],[40,10,41,10],[40,12,41,12],[36,0,55,0],[36,6,45,6],[36,8,45,8],[36,9,37,9],[36,10,37,10],[44,9,45,9],[44,10,45,10],[50,6,55,6],[50,8,55,8],[50,10,55,10],[44,12,45,12],[44,14,45,14],[46,6,47,6],[46,8,47,8],[48,6,49,6],[48,8,49,8],[40,14,41,14],[42,9,43,9],[42,10,43,10],[42,12,43,12],[42,14,43,14],[57,10,60,10],[61,6,64,6],[61,8,64,8],[61,10,64,10],[65,6,81,6],[65,9,67,9],[71,9,73,9],[57,0,81,0],[57,1,81,1],[57,2,81,2],[57,3,81,3],[57,4,81,4],[71,12,73,12],[74,9,77,9],[74,10,77,10],[74,12,77,12],[78,9,81,9],[78,10,81,10],[78,12,81,12],[65,10,67,10],[65,12,67,12],[68,9,70,9],[68,10,70,10],[68,12,70,12]]}
["Tipo de incidencia","Mensaje CSC","Significado","significado comunicación csc","Acción 1","Posibilidades tras acción 1","Acción 2","Posibilidades tras acción 2","Acción 3","Posibilidades tras acción 3","Acción 4","Posibilidades tras acción 4","Acción 5","Posibilidades tras acción 5"]
[]
["PACKING SLIP MISSING","Goods are still to be delivered","Mercancía todavía pendientes de recepción","El CSC no encuentra la recepción realizada","Confirmar si hay o no recepción en ese PO","Existe recepción Anterior a la Incidencia","Contactar con Admon y seleccionar la opción siguiente",null,"Seleccionar WRONG PO (Número de pedido incorrecto) y escribir Right PO number is 45XXXXXXXX (numero de pedido correcto es 45XXXXXXXX)",null,"FIN INCIDENCIAS"]
[null,"Still to be delivered: PO4501801079","Pendente de ser entregado: PO 45XXXXXXXX"]
[null,"no goods receipt PO 4501667818","No hay recepción de mercancías para pedido número 45XXXXXXXX"]
[null,"Items not yet delivered: PO number 8000002740;","Productos no entregados PO número 45XXXXXXX",null,null,"No existe recepción","Comprobar si procede o no la recepcion (ver si la mercancía se recepciono o no)","Procede la recepción","Recepcionar via WF",null,"Si la incidencia no desaparece tras la acción anterior seleccionar Cantactar con admon y seleccionar la opción GR is done (Entrada de mercancía está hecha) e indicar \"GR is done with reception number 50XXXXXXXX\" (Entrada de mercancía realizada con número de recepción 50XXXXXXXX)"]
[null,"Item is not yet delivered for PO 4501871325. line item name:  ACEITE DE OLIVA V.E. CORNICABRA 50 CL.","Productos no entregados PO número 45XXXXXXX, nombre de la linea AAAAAA"]
[null,"All PO numbers provided in the invoice are not yet delivered.","Todos los PO en la factura no han sido entregados",null,null,null,null,"No procede la recepción","Contactar con Admon y seleccionar la opción siguiente",null,"Seleccionar REJECT INVOICE (Rechazar factura) y escribir Reject invoice (Rechazar factura)"]
{"$rows_left_out":72}
{"sheet":"Hoja automatica","index":1,"n_rows":50,"n_cols":6,"rows_kept":50,"cut":false,"hidden":false,"merged":[]}
[{"$f":"VLOOKUP(D1,Traducciones!A:G,$E$2+1,FALSE)","v":"Tipo de incidencia"},null,null,"TIT01",null,"Idioma"]
[null,null,null,null,2,{"$f":"HLOOKUP(E2,Traducciones!B1:H2,2,FALSE)","v":"Español"}]
[{"$f":"VLOOKUP(D3,Traducciones!A:G,$E$2+1,FALSE)","v":"Nota que aparece del CSC"},null,null,"TIT02"]
[null,{"$f":"IFERROR(IF('Listados opciones selecc'!C2=\"QI\",1,IF('Listados opciones selecc'!C2=\"PI\",1,0)),0)","v":0}]
[{"$f":"VLOOKUP(D5,Traducciones!A:G,E2+1,FALSE)","v":"Traducción nota"},null,null,"TIT03"]
[{"$f":"IFERROR(IF(B4=1,VLOOKUP('Listados opciones selecc'!E4,Listados!C:E,3,FALSE),IFERROR(VLOOKUP(A4,Listados!C:E,3,FALSE),\"\")),\"\")","v":""},{"$f":"IFERROR(IF('Listados opciones selecc'!C2=\"QI\",1,IF('Listados opciones selecc'!C2=\"PI\",1,0)),0)","v":0}]
[{"$f":"VLOOKUP(D7,Traducciones!A:G,E2+1,FALSE)","v":"Significado comunicación CSC"},null,null,"TIT04"]
[{"$f":"IFERROR(IF(B6=1,VLOOKUP(A2,Listados!B:G,6,FALSE),IFERROR(VLOOKUP(A6,Listados!E:G,3,FALSE),\"\")),\"\")","v":""},null,null,null,null,{"$f":"SUM(E12:E34)","v":0}]
{"$rows_left_out":43}
{"sheet":"Listados opciones selecc","index":2,"n_rows":106,"n_cols":12,"rows_kept":106,"cut":false,"hidden":true,"merged":[]}
["Tipo de incidencia",null,null,null,null,null,null,null,null,null,"ENDPROCESS",{"$f":"VLOOKUP(K1,Traducciones!A:G,'Hoja automatica'!E2+1,FALSE)","v":"Fin del proceso. Incidencia resuelta"}]
[{"$f":"'Hoja automatica'!A2","v":0},null,{"$f":"VLOOKUP(A2,Listados!B28:C29,2,FALSE)","v":{"$error":"#N/A"}}]
["Nota que aparece del CSC"]
[{"$f":"IF(EXACT(Listados!B:B,$A$2),ROW(Listados!B:B),0)","v":0},{"$f":"IF(A4=0,0,1)","v":0},{"$f":"IF(A4=0,\" \",INDEX(Listados!C:C,'Listados opciones selecc'!A4,1))","v":" "},1,{"$f":"IFERROR(INDEX($B$4:$C$48,MATCH(D4,$B$4:$B$48,0),2),\"\")","v":""}]
[0,{"$f":"IF(A5=0,0,B4+1)","v":0},{"$f":"IF(A5=0,\" \",INDEX(Listados!C:C,'Listados opciones selecc'!A5,1))","v":" "},2,""]
[0,{"$f":"IF(A6=0,0,MAX(B4:B5)+1)","v":0},{"$f":"IF(A6=0,\" \",INDEX(Listados!C:C,'Listados opciones selecc'!A6,1))","v":" "},3,""]
[0,{"$f":"IF(A7=0,0,MAX(B4:B6)+1)","v":0},{"$f":"IF(A7=0,\" \",INDEX(Listados!C:C,'Listados opciones selecc'!A7,1))","v":" "},4,""]
[0,{"$f":"IF(A8=0,0,MAX(B4:B7)+1)","v":0},{"$f":"IF(A8=0,\" \",INDEX(Listados!C:C,'Listados opciones selecc'!A8,1))","v":" "},5,""]
{"$rows_left_out":99}
{"sheet":"Listados","index":3,"n_rows":35,"n_cols":55,"rows_kept":35,"cut":false,"hidden":true,"merged":[[0,43,0,45],[0,15,0,17],[0,24,0,25],[0,32,0,33],[0,10,0,12],[0,19,0,22],[0,27,0,30],[0,35,0,38],[0,40,0,41]]}
["Tipo de incidencia",null,"Respuesta CSC","Código respuesta","Traducción","Codogi Mignificado","significado comunicación csc","Código acción 1","Acción 1",null,"Posibilidades tras acción 1",null,null,null,null,"ACCION B (2)",null,null,null,"Posibilidades tras acción 2",null,null,null,null,"accion c",null,null,"posibilidades tras accion c",null,null,null,null,"ACCION D",null,null,"Opciones acción 4",null,null,null,null,"Acción 5",null,null,"Opciones accion 5",null,null,null,"Acción 6",null,null,"Accion 7",null,null,null,"Acción8"]
["Packing Slip Missing","Packing Slip Missing","Goods are still to be delivered","RPSM01",{"$f":"VLOOKUP(D2,Traducciones!A:G,'Hoja automatica'!$E$2+1,FALSE)","v":"Mercancía todavía pendiente de recepción"},"M01",{"$f":"VLOOKUP(F2,Traducciones!A:G,'Hoja automatica'!$E$2+1,FALSE)","v":"El CSC no encuentra la recepción realizada"},"A10",{"$f":"VLOOKUP(H2,Traducciones!A:G,'Hoja automatica'!$E$2+1,FALSE)","v":"Confirmar si hay o no recepción en ese PO"},null,"A10","01",{"$f":"VLOOKUP(CONCATENATE(K2,L2),Traducciones!A:G,'Hoja automatica'!$E$2+1,FALSE)","v":"Existe recepción Anterior a la Incidencia"},"01",null,"Código ","Acción a realizar","Codigo opción",null,null,null,null,"Codigo Opcion",null,"Codigo opción anterior","Acción",null,null,"Codigo ",null,"Codigo ",null,"Codigo","accion",null,{"$f":"AG18&\"D\"","v":"A1400B00C02D"},"01",{"$f":"+VLOOKUP(CONCATENATE(AJ2,AK2),Traducciones!A:G,'Hoja automatica'!$E$2+1,FALSE)","v":"Las facturas refieren al mismo albaran/servicio"},"01",null,"Desc",null,null,{"$f":"AO19","v":"A1400B00C02D02"},{"$f":"VLOOKUP(CONCATENATE(AR2,\"E\",AT2),Traducciones!A:G,'Hoja automatica'!$E$2+1,FALSE)","v":"Procede recepciónar el nuevo albarán /servicio"},"01",null,"Desc",null,null,{"$f":"CONCATENATE(AV19,\"F\")","v":"A1400B00C02D02E01F"},{"$f":"VLOOKUP(CONCATENATE(AY2,\"G\"),Traducciones!A:G,'Hoja automatica'!$E$2+1,FALSE)","v":"Si la incidencia no desaparece tras la acción anterior seleccionar Cantactar con admon y seleccionar la opción GR is done (Entrada de mercancía está hecha) e indicar \"GR is done with reception number 50XXXXXXXX\" (Entrada de mercancía realizada con número de recepción 50XXXXXXXX)"},null,{"$f":"CONCATENATE(AY2,\"G\")","v":"A1400B00C02D02E01FG"},{"$f":"VLOOKUP(CONCATENATE(BB2,\"H\"),Traducciones!A:G,'Hoja automatica'!$E$2+1,FALSE)","v":"Fin del proceso. Incidencia resuelta"}]
["PO Line Missing","Packing Slip Missing","Still to be delivered: PO45XXXXXXX","RPSM02",{"$f":"VLOOKUP(D3,Traducciones!A:G,'Hoja automatica'!$E$2+1,FALSE)","v":"Pendiente de ser entregado: PO 45XXXXXXXX"},"M01",{"$f":"VLOOKUP(F3,Traducciones!A:G,'Hoja automatica'!$E$2+1,FALSE)","v":"El CSC no encuentra la recepción realizada"},"A10",{"$f":"VLOOKUP(H3,Traducciones!A:G,'Hoja automatica'!$E$2+1,FALSE)","v":"Confirmar si hay o no recepción en ese PO"},null,"A10","02",{"$f":"VLOOKUP(CONCATENATE(K3,L3),Traducciones!A:G,'Hoja automatica'!$E$2+1,FALSE)","v":"No existe recepción"},"02",null,"A1001B",{"$f":"VLOOKUP(P3,Traducciones!A:G,'Hoja automatica'!$E$2+1,FALSE)","v":"Contactar con Admon y seleccionar la opción siguiente"},{"$f":"P3","v":"A1001B"},null,"A1002B","01",{"$f":"VLOOKUP(CONCATENATE(T3,U3),Traducciones!A:G,'Hoja automatica'!$E$2+1,FALSE)","v":"Procede la recepción del pedido"},"01",null,{"$f":"CONCATENATE(R3,\"00\")","v":"A1001B00"},{"$f":"VLOOKUP(CONCATENATE(Y3,\"C\"),Traducciones!A:G,'Hoja automatica'!$E$2+1,FALSE)","v":"Seleccionar NOT_REAL (Incidencia erronea) y escribir \"GR \"#5xxxxxx\" done on \"dd/mm/yy\". Please post for this GR (GR (entrada de mercancías hecha en \". Por  favor facturar para esta GR)"},null,{"$f":"Y9&\"C\"","v":"A1202B01C"},"01",{"$f":"VLOOKUP(CONCATENATE(AB3,AC3),Traducciones!A:G,'Hoja automatica'!$E$2+1,FALSE)","v":"la linea está en el pedido y no fue recepcionada"},"01",null,{"$f":"CONCATENATE(Y3,\"C00\")","v":"A1001B00C00"},{"$f":"VLOOKUP(CONCATENATE(AG3,\"D\"),Traducciones!A:G,'Hoja automatica'!$E$2+1,FALSE)","v":"Fin del proceso. Incidencia resuelta"},null,{"$f":"AJ2","v":"A1400B00C02D"},"02",{"$f":"+VLOOKUP(CONCATENATE(AJ3,AK3),Traducciones!A:G,'Hoja automatica'!$E$2+1,FALSE)","v":"Las facturas NO refieren al mismo albarán/servicio"},"02",null,{"$f":"CONCATENATE(AG3,\"D00\")","v":"A1001B00C00D00"},{"$f":"VLOOKUP(CONCATENATE(AO3,\"E\"),Traducciones!A:G,'Hoja automatica'!$E$2+1,FALSE)","v":{"$error":"#N/A"}},null,{"$f":"AR2","v":"A1400B00C02D02"},{"$f":"VLOOKUP(CONCATENATE(AR3,\"E\",AT3),Traducciones!A:G,'Hoja automatica'!$E$2+1,FALSE)","v":"No procede recepcionar el nuevo albarán/servicio"},"02",null,{"$f":"CONCATENATE(AO3,\"E00\")","v":"A1001B00C00D00E00"},{"$f":"VLOOKUP(CONCATENATE(AV3,\"F\"),Traducciones!A:G,'Hoja automatica'!$E$2+1,FALSE)","v":{"$error":"#N/A"}},null,{"$f":"CONCATENATE(AV20,\"F\")","v":"A1400B00C02D02E02F"},{"$f":"VLOOKUP(CONCATENATE(AY3,\"G\"),Traducciones!A:G,'Hoja automatica'!$E$2+1,FALSE)","v":"Fin del proceso. Incidencia resuelta"}]
["PO Consumed","Packing Slip Missing","no goods receipt PO 45XXXXXXX","RPSM03",{"$f":"VLOOKUP(D4,Traducciones!A:G,'Hoja automatica'!$E$2+1,FALSE)","v":"No hay recepción de mercancías para pedido número 45XXXXXXXX"},"M01",{"$f":"VLOOKUP(F4,Traducciones!A:G,'Hoja automatica'!$E$2+1,FALSE)","v":"El CSC no encuentra la recepción realizada"},"A10",{"$f":"VLOOKUP(H4,Traducciones!A:G,'Hoja automatica'!$E$2+1,FALSE)","v":"Confirmar si hay o no recepción en ese PO"},null,"A10","03",{"$f":"VLOOKUP(CONCATENATE(K4,L4),Traducciones!A:G,'Hoja automatica'!$E$2+1,FALSE)","v":"Esta hecha la recepción en otro pedido"},"03",null,"A1002B",{"$f":"VLOOKUP(P4,Traducciones!A:G,'Hoja automatica'!$E$2+1,FALSE)","v":"Comprobar si procede o no la recepcion (ver si la mercancía se recepciono o no)"},{"$f":"P4","v":"A1002B"},null,"A1002B","02",{"$f":"VLOOKUP(CONCATENATE(T4,U4),Traducciones!A:G,'Hoja automatica'!$E$2+1,FALSE)","v":"No procede la recepción del pedido"},"02",null,{"$f":"CONCATENATE(R4,W3)","v":"A1002B01"},{"$f":"VLOOKUP(CONCATENATE(Y4,\"C\"),Traducciones!A:G,'Hoja automatica'!$E$2+1,FALSE)","v":"Recepcionar via WF"},null,{"$f":"Y9&\"C\"","v":"A1202B01C"},"02",{"$f":"VLOOKUP(CONCATENATE(AB4,AC4),Traducciones!A:G,'Hoja automatica'!$E$2+1,FALSE)","v":"la línea reclamada no está en el pedido"},"02",null,"A1002B01C00",{"$f":"VLOOKUP(CONCATENATE(AG4,\"D\"),Traducciones!A:G,'Hoja automatica'!$E$2+1,FALSE)","v":"Si la incidencia no desaparece tras la acción anterior seleccionar Cantactar con admon y seleccionar la opción GR is done (Entrada de mercancía está hecha) e indicar \"GR is done with reception number 50XXXXXXXX\" (Entrada de mercancía realizada con número de recepción 50XXXXXXXX)"},null,null,null,null,null,null,{"$f":"CONCATENATE(AG4,\"D00\")","v":"A1002B01C00D00"},{"$f":"VLOOKUP(CONCATENATE(AO4,\"E\"),Traducciones!A:G,'Hoja automatica'!$E$2+1,FALSE)","v":"Fin del proceso. Incidencia resuelta"},null,null,null,null,null,{"$f":"CONCATENATE(AO4,\"E00\")","v":"A1002B01C00D00E00"},{"$f":"VLOOKUP(CONCATENATE(AV4,\"F\"),Traducciones!A:G,'Hoja automatica'!$E$2+1,FALSE)","v":{"$error":"#N/A"}}]
["Quantity Incidence","Packing Slip Missing","Items not yet delivered: PO number 45XXXXXXX;","RPSM04",{"$f":"VLOOKUP(D5,Traducciones!A:G,'Hoja automatica'!$E$2+1,FALSE)","v":"Productos no entregados PO número 45XXXXXXX"},"M01",{"$f":"VLOOKUP(F5,Traducciones!A:G,'Hoja automatica'!$E$2+1,FALSE)","v":"El CSC no encuentra la recepción realizada"},"A10",{"$f":"VLOOKUP(H5,Traducciones!A:G,'Hoja automatica'!$E$2+1,FALSE)","v":"Confirmar si hay o no recepción en ese PO"},null,"A12","01",{"$f":"VLOOKUP(CONCATENATE(K5,L5),Traducciones!A:G,'Hoja automatica'!$E$2+1,FALSE)","v":"Existe la Recepcion de la Línea en ese pedido"},"01",null,"A1003B",{"$f":"VLOOKUP(P5,Traducciones!A:G,'Hoja automatica'!$E$2+1,FALSE)","v":"Contactar con Admon y seleccionar la opción siguiente"},"A1003B",null,"A1202B","01",{"$f":"VLOOKUP(CONCATENATE(T5,U5),Traducciones!A:G,'Hoja automatica'!$E$2+1,FALSE)","v":"Procede la recepción de la linea"},"01",null,{"$f":"CONCATENATE(R4,W4)","v":"A1002B02"},{"$f":"VLOOKUP(CONCATENATE(Y5,\"C\"),Traducciones!A:G,'Hoja automatica'!$E$2+1,FALSE)","v":"Contactar con Admon y seleccionar la opción siguiente"},null,{"$f":"Y16&\"C\"","v":"A1400B00C"},"01",{"$f":"VLOOKUP(CONCATENATE(AB5,AC5),Traducciones!A:G,'Hoja automatica'!$E$2+1,FALSE)","v":"Las facturas son iguales"},"01",null,"A1002B02C00",{"$f":"VLOOKUP(CONCATENATE(AG5,\"D\"),Traducciones!A:G,'Hoja automatica'!$E$2+1,FALSE)","v":"Seleccionar REJECT INVOICE (Rechazar factura) y escribir Reject invoice (Rechazar factura la mercancia no ha sido recepcionada)"},null,null,null,null,null,null,"A1002B02C00D00",{"$f":"VLOOKUP(CONCATENATE(AO5,\"E\"),Traducciones!A:G,'Hoja automatica'!$E$2+1,FALSE)","v":"Fin del proceso. Incidencia resuelta"},null,null,null,null,null,"A1002B02C00D00E00",{"$f":"VLOOKUP(CONCATENATE(AV5,\"F\"),Traducciones!A:G,'Hoja automatica'!$E$2+1,FALSE)","v":{"$error":"#N/A"}}]
["Price Incidence","Packing Slip Missing","Item is not yet delivered for PO 45XXXXXXX. line item name:  (Nombre de un artículo)","RPSM05",{"$f":"VLOOKUP(D6,Traducciones!A:G,'Hoja automatica'!$E$2+1,FALSE)","v":"Productos no entregados PO número 45XXXXXXX, nombre de la linea AAAAAA"},"M01",{"$f":"VLOOKUP(F6,Traducciones!A:G,'Hoja automatica'!$E$2+1,FALSE)","v":"El CSC no encuentra la recepción realizada"},"A10",{"$f":"VLOOKUP(H6,Traducciones!A:G,'Hoja automatica'!$E$2+1,FALSE)","v":"Confirmar si hay o no recepción en ese PO"},null,"A12","02",{"$f":"VLOOKUP(CONCATENATE(K6,L6),Traducciones!A:G,'Hoja automatica'!$E$2+1,FALSE)","v":"No existe la recepción de la línea"},"02",null,"A1100B",{"$f":"VLOOKUP(P6,Traducciones!A:G,'Hoja automatica'!$E$2+1,FALSE)","v":"Fin del proceso. Incidencia resuelta"},"A1100B",null,"A1202B","02",{"$f":"VLOOKUP(CONCATENATE(T6,U6),Traducciones!A:G,'Hoja automatica'!$E$2+1,FALSE)","v":"No procede la recepción de la linea"},"02",null,{"$f":"CONCATENATE(R5,\"00\")","v":"A1003B00"},{"$f":"VLOOKUP(CONCATENATE(Y6,\"C\"),Traducciones!A:G,'Hoja automatica'!$E$2+1,FALSE)","v":"Seleccionar WRONG PO (Número de pedido incorrecto) y escribir Right PO number is 45XXXXXXXX (numero de pedido correcto es 45XXXXXXXX)"},null,{"$f":"Y16&\"C\"","v":"A1400B00C"},"02",{"$f":"VLOOKUP(CONCATENATE(AB6,AC6),Traducciones!A:G,'Hoja automatica'!$E$2+1,FALSE)","v":"Las facturas no son iguales"},"02",null,"A1003B00C00",{"$f":"VLOOKUP(CONCATENATE(AG6,\"D\"),Traducciones!A:G,'Hoja automatica'!$E$2+1,FALSE)","v":"Fin del proceso. Incidencia resuelta"},null,null,null,null,null,null,"A1003B00C00D00",{"$f":"VLOOKUP(CONCATENATE(AO6,\"E\"),Traducciones!A:G,'Hoja automatica'!$E$2+1,FALSE)","v":{"$error":"#N/A"}},null,null,null,null,null,"A1003B00C00D00E00",{"$f":"VLOOKUP(CONCATENATE(AV6,\"F\"),Traducciones!A:G,'Hoja automatica'!$E$2+1,FALSE)","v":{"$error":"#N/A"}}]
[null,"Packing Slip Missing","All PO numbers provided in the invoice are not yet delivered.","RPSM06",{"$f":"VLOOKUP(D7,Traducciones!A:G,'Hoja automatica'!$E$2+1,FALSE)","v":"Todos los PO en la factura no han sido entregados"},"M01",{"$f":"VLOOKUP(F7,Traducciones!A:G,'Hoja automatica'!$E$2+1,FALSE)","v":"El CSC no encuentra la recepción realizada"},"A10",{"$f":"VLOOKUP(H7,Traducciones!A:G,'Hoja automatica'!$E$2+1,FALSE)","v":"Confirmar si hay o no recepción en ese PO"},null,"A12","03",{"$f":"VLOOKUP(CONCATENATE(K7,L7),Traducciones!A:G,'Hoja automatica'!$E$2+1,FALSE)","v":"Existe la Recepcion del artículo en otra linea del P.O."},"03",null,"A1201B",{"$f":"VLOOKUP(P7,Traducciones!A:G,'Hoja automatica'!$E$2+1,FALSE)","v":"Contactar con Admon y seleccionar la opción siguiente"},"A1201B",null,"A1202B","03",{"$f":"VLOOKUP(CONCATENATE(T7,U7),Traducciones!A:G,'Hoja automatica'!$E$2+1,FALSE)","v":"El proveedor sirve otro producto distinto al pedido y sin embargo se recepciona sin modificar pedido. El proveedor factura el producto servido"},"03",null,{"$f":"CONCATENATE(R6,\"00\")","v":"A1100B00"},{"$f":"VLOOKUP(CONCATENATE(Y7,\"C\"),Traducciones!A:G,'Hoja automatica'!$E$2+1,FALSE)","v":{"$error":"#N/A"}},null,null,null,null,null,null,"A1100B00C00",{"$f":"VLOOKUP(CONCATENATE(AG7,\"D\"),Traducciones!A:G,'Hoja automatica'!$E$2+1,FALSE)","v":{"$error":"#N/A"}},null,null,null,null,null,null,"A1100B00C00D00",{"$f":"VLOOKUP(CONCATENATE(AO7,\"E\"),Traducciones!A:G,'Hoja automatica'!$E$2+1,FALSE)","v":{"$error":"#N/A"}},null,null,null,null,null,"A1100B00C00D00E00",{"$f":"VLOOKUP(CONCATENATE(AV7,\"F\"),Traducciones!A:G,'Hoja automatica'!$E$2+1,FALSE)","v":{"$error":"#N/A"}}]
[null,"Packing Slip Missing","PO 45XXXXXXX is still to be delivered.","RPSM07",{"$f":"VLOOKUP(D8,Traducciones!A:G,'Hoja automatica'!$E$2+1,FALSE)","v":"PO 45XXXXXXX está todavía por entregar"},"M01",{"$f":"VLOOKUP(F8,Traducciones!A:G,'Hoja automatica'!$E$2+1,FALSE)","v":"El CSC no encuentra la recepción realizada"},"A10",{"$f":"VLOOKUP(H8,Traducciones!A:G,'Hoja automatica'!$E$2+1,FALSE)","v":"Confirmar si hay o no recepción en ese PO"},null,"A12","04",{"$f":"VLOOKUP(CONCATENATE(K8,L8),Traducciones!A:G,'Hoja automatica'!$E$2+1,FALSE)","v":"Existe la recepción de la línea en otro pedido"},"04",null,"A1202B",{"$f":"VLOOKUP(P8,Traducciones!A:G,'Hoja automatica'!$E$2+1,FALSE)","v":"Comprobar si procede o no la recepcion (ver si la mercancía se recepciono o no)"},"A1202B",null,"A1501B","01",{"$f":"VLOOKUP(CONCATENATE(T8,U8),Traducciones!A:G,'Hoja automatica'!$E$2+1,FALSE)","v":"La base imponible de la factura cuadra con lo recepcionado en sistema"},"01",null,{"$f":"CONCATENATE(R7,\"00\")","v":"A1201B00"},{"$f":"VLOOKUP(CONCATENATE(Y8,\"C\"),Traducciones!A:G,'Hoja automatica'!$E$2+1,FALSE)","v":"Seleccionar NOT_REAL (Incidencia erronea) y escribir \"GR \"#5xxxxxx\" done on \"dd/mm/yy for position XX. Please post for this GR (GR (entrada de mercancías hecha en \"fecha\". Por  favor facturar para esta GR en posicion XX)"},null,null,null,null,null,null,"A1201B00C00",{"$f":"VLOOKUP(CONCATENATE(AG8,\"D\"),Traducciones!A:G,'Hoja automatica'!$E$2+1,FALSE)","v":"Fin del proceso. Incidencia resuelta"},null,null,null,null,null,null,"A1201B00C00D00",{"$f":"VLOOKUP(CONCATENATE(AO8,\"E\"),Traducciones!A:G,'Hoja automatica'!$E$2+1,FALSE)","v":{"$error":"#N/A"}},null,null,null,null,null,"A1201B00C00D00E00",{"$f":"VLOOKUP(CONCATENATE(AV8,\"F\"),Traducciones!A:G,'Hoja automatica'!$E$2+1,FALSE)","v":{"$error":"#N/A"}}]
{"$rows_left_out":28}
{"sheet":"Traducciones","index":4,"n_rows":252,"n_cols":19,"rows_kept":252,"cut":false,"hidden":true,"merged":[]}
[null,1,2,3,4,5,6]
[null,"English ","Español","Nederland","Français","Italiano","Deuscth"]
["Codigo","English translation","Traducción español","Nederland 1",null,"Italiano 1","deuscht 1"]
["A10","Confirm if this P.O has been received","Confirmar si hay o no recepción en ese PO","Bevestig of deze order ontvangen is","Confirmer si ce PO a bien eté reçu","Confermare se questo P.O. è stato ricevuto","Bestätigt, dass die PO empfangen wurde"]
["A1001","There is a GR before the incidence","Existe recepción Anterior a la Incidencia","Er is GR gedaan voor het incident ontstaan is","Il existe une reception qui précede l'incidence.","C'è una ricezione prima della incidence","Die Warenannahme (Good receipt) fand vor dem Inzidenz statt. "]
["A1001B","Contact Admin and select the next option","Contactar con Admon y seleccionar la opción siguiente","Klik op contact with admin en selecteer de volgende optie","Contacter l'administration et selectionner l'option suivante.","premi \"contact with admin\" e seleziona la prossima opzione","Kontaktiere den Admin und wähle die nächste Option"]
["A1001B00C","Select NOT REAL and write  \"GR \"#5xxxxxx\" done on \"dd/mm/yy\"","Seleccionar NOT_REAL (Incidencia erronea) y escribir \"GR \"#5xxxxxx\" done on \"dd/mm/yy\". Please post for this GR (GR (entrada de mercancías hecha en \". Por  favor facturar para esta GR)","Selecteer NOT_REAL en geef het correcte PO nummer: Correct PO is: 45XXXXXXXX (correct order number is 45XXXXXXXX)","Cocher PO erroné( Numero de commande erroné)","Seleziona NOT_REAL e scrivi: \"GR 5xxxxxxxx done on \"DD/MM/YY \" (il numero di ricezione 5xxxxxxxx) ","Wählen Sie NOT_REAL (falsche Inzidenz) und schreiben „GR“ # 5xxxxxx „done auf“ TT / MM / JJ „Bitte senden Sie für diesen GR (GR (Wareneingang gemacht“. Bitte überprüfen Sie für dieses GR)"]
["A1001B00C00D","End of the process. Incidence solved","Fin del proceso. Incidencia resuelta","Einde proces. Incident opgelost","Fin du processus. Incidence resolue.","Fine del processo, incidence risolta.","Ende des Prozesses. Inzidenz ist gelöst. "]
{"$rows_left_out":245}
{"sheet":"Respuestas al CSC","index":5,"n_rows":10,"n_cols":3,"rows_kept":10,"cut":false,"hidden":true,"merged":[]}
["AMNT_MATCH","La cantidad total cuadra","Total amount matches for line XXX/ Total amount matches for invoice"]
["CM_CORRECT","Credit Memo es correcta","Credit memo matches with differences, repost and release invoice"]
["GR_DONE","Entrada de mercancía realizada","GR done, recepciton number 50XXXXXXXX"]
["NOT_PRC","No se trata de una incidencia de precio","Price incidencie in material XXX incorrect. Review matching of the PO lines (enter PO lines to be reviewed)"]
["NOT_QTY","No se trata de una incidencia de cantidad","Quantity incidence in meterial XXX incorrect. Review matching of the PO lines (enter Po lines to be reviewed)"]
["REV_INV","Deshacer contabilización para modificar pedido","To use only if the invoice needs to be corrected, or there is an amended P=/GR by hotel"]
["WRONG PO","Número de pedido incorrecto","Right PO number is"]
["WRONG POLN","Número de linea de pedido incorrecta","Right PO line is"]
{"$rows_left_out":2}