{"text_format":"1","workbook":"xlsx","n_sheets":5,"sheets":["Petty Cash Report","Count sheet","Setup","SETUP2","Journal"],"not_rendered":{"charts":0,"images":1,"macros":1,"external_links":1,"defined_names":105,"comments":1,"pivot_tables":0},"unopened":[],"bounds":{"document_bytes":16777216,"sheet_cells":100000,"rows_first":2000,"rows_last":500,"rows_between":2000,"halvings":0,"cell_chars":16384,"cell_head_chars":4096},"cells_cut":0,"cells_raw":0,"read":"whole","date_system":"1900"}

{"sheet":"Petty Cash Report","index":0,"n_rows":69,"n_cols":20,"rows_kept":69,"cut":false,"hidden":false,"merged":[[0,0,3,4],[64,9,64,10],[65,9,65,10],[66,9,66,10],[67,9,67,10],[68,9,68,10],[59,9,59,10],[60,9,60,10],[61,9,61,10],[62,9,62,10],[63,9,63,10],[54,9,54,10],[55,9,55,10],[56,9,56,10],[57,9,57,10],[58,9,58,10],[49,9,49,10],[50,9,50,10],[51,9,51,10],[52,9,52,10],[53,9,53,10],[44,9,44,10],[45,9,45,10],[46,9,46,10],[47,9,47,10],[48,9,48,10],[39,9,39,10],[40,9,40,10],[41,9,41,10],[42,9,42,10],[43,9,43,10],[34,9,34,10],[35,9,35,10],[36,9,36,10],[37,9,37,10],[38,9,38,10],[29,9,29,10],[30,9,30,10],[31,9,31,10],[32,9,32,10],[33,9,33,10],[24,9,24,10],[25,9,25,10],[26,9,26,10],[27,9,27,10],[28,9,28,10],[19,9,19,10],[20,9,20,10],[21,9,21,10],[22,9,22,10],[23,9,23,10],[4,0,17,0],[4,4,17,4],[4,3,17,3],[4,2,17,2],[4,1,17,1],[19,13,19,14],[20,13,20,14],[21,13,21,14],[22,13,22,14],[23,13,23,14],[24,13,24,14],[25,13,25,14],[26,13,26,14],[27,13,27,14],[28,13,28,14],[29,13,29,14],[30,13,30,14],[31,13,31,14],[32,13,32,14],[33,13,33,14],[35,13,35,14],[36,13,36,14],[37,13,37,14],[45,13,45,14],[46,13,46,14],[47,13,47,14],[48,13,48,14],[39,13,39,14],[40,13,40,14],[41,13,41,14],[42,13,42,14],[43,13,43,14],[68,13,68,14],[59,13,59,14],[60,13,60,14],[61,13,61,14],[62,13,62,14],[63,13,63,14],[18,13,18,14],[64,13,64,14],[65,13,65,14],[66,13,66,14],[67,13,67,14],[54,13,54,14],[55,13,55,14],[56,13,56,14],[57,13,57,14],[58,13,58,14],[49,13,49,14],[50,13,50,14],[51,13,51,14],[52,13,52,14],[53,13,53,14],[44,13,44,14],[38,13,38,14],[34,13,34,14]]}
["Ocultar"]
[null,null,null,null,null,null,null,null,null,null,null,null,null,null,null,null,null,null,"Mini Set-up"]
[null,null,null,null,null,null,null,null,null,null,null,null,null,null,null,null,null,null,"BU",{"$f":"VLOOKUP(J12,SETUP2!$C$5:$D$10,2,FALSE)","v":{"$error":"#N/A"}}]
[null,null,null,null,null,null,null,null,null,null,null,null,null,null,null,null,null,null,"Center",{"$f":"IF(BA=9039,\"Centro_9039\",IF(BA=9700,\"Centro_9700\",\"Centro_Otros\"))","v":"Centro_Otros"}]
[null,null,null,null,"Linea para departamentos",null,null,null,null,null,null,null,null,null,null,null,null,null,"Currency",{"$f":"CONCATENATE(\"CURR\",T3)","v":{"$error":"#N/A"}}]
[]
[]
[null,null,null,null,null,null,null,null,null,null,null,null,null,null,null,"Reimbursement"]
[null,null,null,null,null,null,null,null,"Petty Cash report",null,null,null,null,null,null,"* Fill in case a reimbursement of the petty cash fund"]
[]
[null,null,null,null,null,null,null,null,"Contact Name",null,null,null,null,null,"Date","Amount"]
[null,null,null,null,null,null,null,null,"Business Unit",null,null,"Year"]
[null,null,null,null,null,null,null,null,"Country",null,null,"Month"]
[null,null,null,null,null,null,null,null,"Center",null,null,"Currency"]
[null,null,null,null,null,null,null,null,"Business Area",{"$f":"IF(Hotel=\"\",\"\",VLOOKUP(Hotel,SETUP2!F:J,5,FALSE))","v":""},null,"Opening Balance"]
[null,null,null,null,null,null,null,null,"Company Code",{"$f":"IF(J14=\"\",\"\",VLOOKUP(Hotel,SETUP2!F:J,4,FALSE))","v":""},null,"Closing Balance",{"$f":"StartSaldo-SUM(N20:O69)+SUM(P13:P16)","v":0}]
[null,null,null,null,null,null,null,null,null,null,null,null,null,null,null,null,null,null,"Nro. Cuenta","CeCo"]
[]
[null,null,null,null,null,null,null,"Nr","Date","Expense category",null,"Department","Comments","Amount",null,"Running Balance"]
[null,null,null,null,{"$f":"CONCATENATE(VLOOKUP(J20,SETUP2!O:R,4,FALSE),IF(BA=9039,\"_9039\",\"\"))","v":{"$error":"#N/A"}},null,null,1,null,null,null,null,null,null,null,{"$f":"IF(I20=\"\",\"\",SUMIF($O$13:$O$16,\"<=\"&I20,$P$13:$P$16)+$M$15-SUM($N$20:$N20))","v":""},null,null,{"$f":"IF(I20=\"\",\"\",VLOOKUP(J20,SETUP2!$O:$Q,3,FALSE))","v":""},{"$f":"HLOOKUP(L20,SETUP2!$T$39:$BB$40,2,FALSE)","v":{"$error":"#N/A"}}]
[null,null,null,null,{"$f":"CONCATENATE(VLOOKUP(J21,SETUP2!O:R,4,FALSE),IF(BA=9039,\"_9039\",\"\"))","v":{"$error":"#N/A"}},null,null,2,null,null,null,null,null,null,null,{"$f":"IF(I21=\"\",\"\",SUMIF($O$13:$O$16,\"<=\"&I21,$P$13:$P$16)+$M$15-SUM($N$20:$N21))","v":""},null,null,{"$f":"IF(I21=\"\",\"\",VLOOKUP(J21,SETUP2!$O:$Q,3,FALSE))","v":""},{"$f":"HLOOKUP(L21,SETUP2!$T$39:$BB$40,2,FALSE)","v":{"$error":"#N/A"}}]
[null,null,null,null,{"$f":"CONCATENATE(VLOOKUP(J22,SETUP2!O:R,4,FALSE),IF(BA=9039,\"_9039\",\"\"))","v":{"$error":"#N/A"}},null,null,3,null,null,null,null,null,null,null,{"$f":"IF(I22=\"\",\"\",SUMIF($O$13:$O$16,\"<=\"&I22,$P$13:$P$16)+$M$15-SUM($N$20:$N22))","v":""},null,null,{"$f":"IF(I22=\"\",\"\",VLOOKUP(J22,SETUP2!$O:$Q,3,FALSE))","v":""},{"$f":"HLOOKUP(L22,SETUP2!$T$39:$BB$40,2,FALSE)","v":{"$error":"#N/A"}}]
[null,null,null,null,{"$f":"CONCATENATE(VLOOKUP(J23,SETUP2!O:R,4,FALSE),IF(BA=9039,\"_9039\",\"\"))","v":{"$error":"#N/A"}},null,null,4,null,null,null,null,null,null,null,{"$f":"IF(I23=\"\",\"\",SUMIF($O$13:$O$16,\"<=\"&I23,$P$13:$P$16)+$M$15-SUM($N$20:$N23))","v":""},null,null,{"$f":"IF(I23=\"\",\"\",VLOOKUP(J23,SETUP2!$O:$Q,3,FALSE))","v":""},{"$f":"HLOOKUP(L23,SETUP2!$T$39:$BB$40,2,FALSE)","v":{"$error":"#N/A"}}]
[null,null,null,null,{"$f":"CONCATENATE(VLOOKUP(J24,SETUP2!O:R,4,FALSE),IF(BA=9039,\"_9039\",\"\"))","v":{"$error":"#N/A"}},null,null,5,null,null,null,null,null,null,null,{"$f":"IF(I24=\"\",\"\",SUMIF($O$13:$O$16,\"<=\"&I24,$P$13:$P$16)+$M$15-SUM($N$20:$N24))","v":""},null,null,{"$f":"IF(I24=\"\",\"\",VLOOKUP(J24,SETUP2!$O:$Q,3,FALSE))","v":""},{"$f":"HLOOKUP(L24,SETUP2!$T$39:$BB$40,2,FALSE)","v":{"$error":"#N/A"}}]
[null,null,null,null,{"$f":"CONCATENATE(VLOOKUP(J25,SETUP2!O:R,4,FALSE),IF(BA=9039,\"_9039\",\"\"))","v":{"$error":"#N/A"}},null,null,6,null,null,null,null,null,null,null,{"$f":"IF(I25=\"\",\"\",SUMIF($O$13:$O$16,\"<=\"&I25,$P$13:$P$16)+$M$15-SUM($N$20:$N25))","v":""},null,null,{"$f":"IF(I25=\"\",\"\",VLOOKUP(J25,SETUP2!$O:$Q,3,FALSE))","v":""},{"$f":"HLOOKUP(L25,SETUP2!$T$39:$BB$40,2,FALSE)","v":{"$error":"#N/A"}}]
[null,null,null,null,{"$f":"CONCATENATE(VLOOKUP(J26,SETUP2!O:R,4,FALSE),IF(BA=9039,\"_9039\",\"\"))","v":{"$error":"#N/A"}},null,null,7,null,null,null,null,null,null,null,{"$f":"IF(I26=\"\",\"\",SUMIF($O$13:$O$16,\"<=\"&I26,$P$13:$P$16)+$M$15-SUM($N$20:$N26))","v":""},null,null,{"$f":"IF(I26=\"\",\"\",VLOOKUP(J26,SETUP2!$O:$Q,3,FALSE))","v":""},{"$f":"HLOOKUP(L26,SETUP2!$T$39:$BB$40,2,FALSE)","v":{"$error":"#N/A"}}]
[null,null,null,null,{"$f":"CONCATENATE(VLOOKUP(J27,SETUP2!O:R,4,FALSE),IF(BA=9039,\"_9039\",\"\"))","v":{"$error":"#N/A"}},null,null,8,null,null,null,null,null,null,null,{"$f":"IF(I27=\"\",\"\",SUMIF($O$13:$O$16,\"<=\"&I27,$P$13:$P$16)+$M$15-SUM($N$20:$N27))","v":""},null,null,{"$f":"IF(I27=\"\",\"\",VLOOKUP(J27,SETUP2!$O:$Q,3,FALSE))","v":""},{"$f":"HLOOKUP(L27,SETUP2!$T$39:$BB$40,2,FALSE)","v":{"$error":"#N/A"}}]
[null,null,null,null,{"$f":"CONCATENATE(VLOOKUP(J28,SETUP2!O:R,4,FALSE),IF(BA=9039,\"_9039\",\"\"))","v":{"$error":"#N/A"}},null,null,9,null,null,null,null,null,null,null,{"$f":"IF(I28=\"\",\"\",SUMIF($O$13:$O$16,\"<=\"&I28,$P$13:$P$16)+$M$15-SUM($N$20:$N28))","v":""},null,null,{"$f":"IF(I28=\"\",\"\",VLOOKUP(J28,SETUP2!$O:$Q,3,FALSE))","v":""},{"$f":"HLOOKUP(L28,SETUP2!$T$39:$BB$40,2,FALSE)","v":{"$error":"#N/A"}}]
[null,null,null,null,{"$f":"CONCATENATE(VLOOKUP(J29,SETUP2!O:R,4,FALSE),IF(BA=9039,\"_9039\",\"\"))","v":{"$error":"#N/A"}},null,null,10,null,null,null,null,null,null,null,{"$f":"IF(I29=\"\",\"\",SUMIF($O$13:$O$16,\"<=\"&I29,$P$13:$P$16)+$M$15-SUM($N$20:$N29))","v":""},null,null,{"$f":"IF(I29=\"\",\"\",VLOOKUP(J29,SETUP2!$O:$Q,3,FALSE))","v":""},{"$f":"HLOOKUP(L29,SETUP2!$T$39:$BB$40,2,FALSE)","v":{"$error":"#N/A"}}]
[null,null,null,null,{"$f":"CONCATENATE(VLOOKUP(J30,SETUP2!O:R,4,FALSE),IF(BA=9039,\"_9039\",\"\"))","v":{"$error":"#N/A"}},null,null,11,null,null,null,null,null,null,null,{"$f":"IF(I30=\"\",\"\",SUMIF($O$13:$O$16,\"<=\"&I30,$P$13:$P$16)+$M$15-SUM($N$20:$N30))","v":""},null,null,{"$f":"IF(I30=\"\",\"\",VLOOKUP(J30,SETUP2!$O:$Q,3,FALSE))","v":""},{"$f":"HLOOKUP(L30,SETUP2!$T$39:$BB$40,2,FALSE)","v":{"$error":"#N/A"}}]
{"$rows_left_out":40}
{"sheet":"Count sheet","index":1,"n_rows":24,"n_cols":11,"rows_kept":24,"cut":false,"hidden":true,"merged":[[25,7,25,10]]}
[]
[]
[]
[null,null,null,null,null,"Notes",null,null,null,"Other"]
[null,null,null,500,null,null,null,null,null,"monetary"]
[null,null,null,200,null,null,null,null,null,"values"]
[null,null,null,100]
[null,null,null,50]
[null,null,null,20]
[null,null,null,10]
[null,null,null,5]
[]
[null,null,null,null,null,"Coins","Rolls"]
[null,null,null,2]
[null,null,null,1]
[null,null,null,0.5]
[null,null,null,0.2]
[null,null,null,0.1]
[null,null,null,0.05]
[null,null,null,0.02]
[null,null,null,0.01]
[]
[]
[null,null,null,null,null,null,null,null,null,"Total value :",{"$f":"ROUND(F5*D5+F6*D6+F7*D7+F8*D8+F9*D9+F10*D10+F11*D11+(F14+G14*Roll2)*D14+(F15+G15*Roll1)*D15+(F16+G16*Roll05)*D16+(F17+G17*Roll02)*D17+(F18+G18*Roll01)*D18+(F19+G19*Roll005)*D19+(F20+G20*Roll002)*D20+(F21+G21*Roll001)*D21+SUM(J7:J21),2)","v":0}]

{"sheet":"Setup","index":2,"n_rows":56,"n_cols":40,"rows_kept":56,"cut":false,"hidden":true,"merged":[[1,1,2,1],[1,3,2,3],[1,2,2,2]]}
[]
[null,"Expense category","Order","Account","Front Office","Housekeeping Rooms","Restaurant","Other Income","Banqueting","Administration","Sales Hotel","Proyects, Construtions, Engineering & Maintenance","Operations Control"]
[null,null,null,null,"01","02",11,99,80,"AD","SA","PM","OP",null,null,null,null,null,null,null,null,null,null,null,null,null,null,null,"Hotel name","Company","B.A.","Country","City",null,null,null,null,null,"Other parameters"]
[null,"Purchase Food",10,61100001,null,null,"x",null,null,null,null,null,null,61100001,null,null,"Restaurant",null,null,null,null,null,null,null,null,null,null,null,"NH GRONINGEN","NL46","0200","THE NETHERLANDS","GRONINGEN",null,null,null,null,null,"A/P clearance account",40000001]
[null,"Purchase Beverage",11,61101001,null,null,"x",null,null,null,null,null,null,61101001,null,null,"Restaurant",null,null,null,null,null,null,null,null,null,null,null,"NH JAN TABAK","NL40","0207","THE NETHERLANDS","BUSSUM",null,null,null,null,null,"A/P clearance acc. departm.","00000"]
[null,"Guest Supplies Rooms",12,61110001,null,"x",null,null,null,null,null,null,null,61110001,null,null,"Housekeeping Rooms",null,null,null,null,null,null,null,null,null,null,null,"NH GALAXY","NL36","0208","THE NETHERLANDS","AMSTERDAM",null,null,null,null,null,"Petty cash account","57000001"]
[null,"Guest supplies F&B",13,61115001,null,null,"x",null,null,null,null,null,null,61115001,null,null,"Restaurant",null,null,null,null,null,null,null,null,null,null,null,"NH CARANSA","NL34","0209","THE NETHERLANDS","AMSTERDAM",null,null,null,null,null,"Petty cash acc. departm.","00000"]
[null,"Cleaning Supplies",14,62920000,"x",null,"x",null,null,null,null,null,null,62920000,null,null,"Front Office","Restaurant",null,null,null,null,null,null,null,null,null,null,"NH SCHILLER","NL34","0210","THE NETHERLANDS","AMSTERDAM",null,null,null,null,null,"VAT account","47700003"]
[null,"Guest Transfer Expenses - Rooms, F&B & Transport",15,62050000,"x",null,null,null,null,null,null,null,null,62050000,null,null,"Front Office",null,null,null,null,null,null,null,null,null,null,null,"NH DOELEN","NL33","0211","THE NETHERLANDS","AMSTERDAM",null,null,null,null,null,"VAT acc. Departm.","00000"]
[null,"Decoration",30,62924000,"x",null,"x",null,"x",null,null,null,null,62924000,null,null,"Front Office","Restaurant","Banqueting",null,null,null,null,null,null,null,null,null,"NH TROPEN","NL56","0212","THE NETHERLANDS","AMSTERDAM",null,null,null,null,null,"First year in list",2016]
[null,"China, Glassware & Silverware",31,62922000,null,null,"x",null,null,null,null,null,null,62922000,null,null,"Restaurant",null,null,null,null,null,null,null,null,null,null,null,"NH MUSEUM QUARTER","NL26","0213","THE NETHERLANDS","AMSTERDAM",null,null,null,null,null,null,{"$f":"1+AN10","v":2017}]
[null,"Small Repairs & Material",33,62207000,null,null,null,null,null,null,null,"x",null,62207000,null,null,"Proyects, Construtions, Engineering & Maintenance",null,null,null,null,null,null,null,null,null,null,null,"NH CITY CENTRE AMSTERDAM","NL42","0214","THE NETHERLANDS","AMSTERDAM",null,null,null,null,null,null,{"$f":"1+AN11","v":2018}]
[null,"Printing And Stationary",34,62921000,"x",null,"x",null,null,"x",null,null,null,62921000,null,null,"Front Office","Restaurant","Administration",null,null,null,null,null,null,null,null,null,"NH AMSTERDAM CENTRE","NL22","0215","THE NETHERLANDS","AMSTERDAM",null,null,null,null,null,null,{"$f":"1+AN12","v":2019}]
[null,"Mail and Courier",36,62941000,null,null,null,null,null,"x",null,null,null,62941000,null,null,"Administration",null,null,null,null,null,null,null,null,null,null,null,"NH BARBIZON PALACE","NL13","0216","THE NETHERLANDS","AMSTERDAM",null,null,null,null,null,null,{"$f":"1+AN13","v":2020}]
[null,"Drugstore, pharmacy staff",40,64920000,null,null,null,null,null,"x",null,null,null,64920000,null,null,"Administration",null,null,null,null,null,null,null,null,null,null,null,"NH SCHIPHOL AIRPORT","NL24","0217","THE NETHERLANDS","HOOFDDORP",null,null,null,null,null,"Document sources","Invoice"]
[null,"Drugstore, pharmacy Guest",41,62929000,null,null,null,null,null,null,"x",null,null,62929000,null,null,"Sales Hotel",null,null,null,null,null,null,null,null,null,null,null,"NH GRAND HOTEL KRASNAPOLSKY","NL49","0218","THE NETHERLANDS","AMSTERDAM",null,null,null,null,null,null,"Other than invoice"]
[null,"Newspapers Guests",50,60110000,null,"x",null,null,null,null,null,null,null,60110000,null,null,"Housekeeping Rooms",null,null,null,null,null,null,null,null,null,null,null,"NH NAARDEN","NL45","0219","THE NETHERLANDS","NAARDEN"]
[null,"Music & entertainment",55,62952000,"x",null,null,null,null,null,null,null,null,62952000,null,null,"Front Office",null,null,null,null,null,null,null,null,null,null,null,"NH UTRECHT","NL35","0221","THE NETHERLANDS","UTRECHT",null,null,null,null,null,"Number of coins in roll:"]
[null,"Uniforms",60,64900000,"x","x","x",null,"x",null,"x","x","x",64900000,null,null,"Front Office","Housekeeping Rooms","Restaurant","Banqueting","Sales Hotel","Proyects, Construtions, Engineering & Maintenance","Operations Control",null,null,null,null,null,"NH ZANDVOORT","NL27","0222","THE NETHERLANDS","ZANDVOORT",null,null,null,null,null,2,25]
[null,"Taxi Guest (non Guest Transfer)",81,62400000,null,null,null,null,null,null,null,null,"x",62400000,null,null,"Operations Control",null,null,null,null,null,null,null,null,null,null,null,"NH ZOETERMEER","NL28","0232","THE NETHERLANDS","ZOETERMEER",null,null,null,null,null,1,25]
[null,"Parking Cost For Guest",83,62915000,null,null,null,"x",null,null,null,null,null,62915000,null,null,"Other Income",null,null,null,null,null,null,null,null,null,null,null,"NH CENTRE UTRECHT","NL43","0234","THE NETHERLANDS","UTRECHT",null,null,null,null,null,0.5,40]
[null,"Gift And Flowers Guests comlementary",103,62929000,null,null,null,null,null,null,"x",null,null,62929000,null,null,"Sales Hotel",null,null,null,null,null,null,null,null,null,null,null,"NH ATLANTA ROTTERDAM","NL29","0235","THE NETHERLANDS","ROTTERDAM",null,null,null,null,null,0.2,40]
[null,"Gift And Flowers Guests paid by guest",104,62929000,null,null,null,"x",null,null,null,null,null,62929000,null,null,"Other Income",null,null,null,null,null,null,null,null,null,null,null,"NH MARQUETTE","NL39","0241","THE NETHERLANDS","HEEMSKERK",null,null,null,null,null,0.1,40]
[null,"Flowers And Gifts Staff",104,64920004,null,null,null,null,null,"x",null,null,null,64920004,null,null,"Administration",null,null,null,null,null,null,null,null,null,null,null,"NH MAASTRICHT","NL23","0243","THE NETHERLANDS","MAASTRICHT",null,null,null,null,null,0.05,50]
[null,"Miscellaneous",200,62929000,"x",null,"x",null,null,"x","x","x",null,62929000,null,null,"Front Office","Restaurant","Administration","Sales Hotel","Proyects, Construtions, Engineering & Maintenance",null,null,null,null,null,null,null,"NH CAPELLE","NL25","0244","THE NETHERLANDS","CAPELLE AAN DEN IJSSEL",null,null,null,null,null,0.02,50]
[null,null,null,null,null,null,null,null,null,null,null,null,null,null,null,null,null,null,null,null,null,null,null,null,null,null,null,null,"NH GELDROP","NL15","0245","THE NETHERLANDS","GELDROP",null,null,null,null,null,0.01,50]
[null,null,null,null,null,null,null,null,null,null,null,null,null,null,null,null,null,null,null,null,null,null,null,null,null,null,null,null,"NH BEST","NL44","0246","THE NETHERLANDS","BEST",null,null,null,null,null,"Setup sheet changed ?",false]
[null,null,null,null,null,null,null,null,null,null,null,null,null,null,null,null,null,null,null,null,null,null,null,null,null,null,null,null,"NH RIJNHOTEL","NL14","0247","THE NETHERLANDS","ARNHEM",null,null,null,null,null,"Error handler active ?",true]
[null,null,null,null,null,null,null,null,null,null,null,null,null,null,null,null,null,null,null,null,null,null,null,null,null,null,null,null,"NH HOTEL DE VILLE","NL47","0250","THE NETHERLANDS","GRONINGEN",null,null,null,null,null,"Email in case of errors"]
[null,null,null,null,null,null,null,null,null,null,null,null,null,null,null,null,null,null,null,null,null,null,null,null,null,null,null,null,"NH DEN HAAG","NL30","0315","THE NETHERLANDS","DEN HAAG"]
{"$rows_left_out":27}
{"sheet":"SETUP2","index":3,"n_rows":198,"n_cols":138,"rows_kept":198,"cut":false,"hidden":true,"merged":[[37,19,37,45],[37,46,37,53],[39,62,39,90]]}
[]
[null,null,null,null,null,"BENELUX"]
[]
[null,"Parameters",null,null,null,"BA Name","Country","Type","Company","BA number"]
[null,"Business Unit",null,"BU_BENELUX",null,"Belgium"]
[null,null,"Central Europe","BU_CENTRAL_EUROPE"]
[null,null,"Italy","BU_ITALY"]
[null,null,"Spain","BU_SPAIN"]
[null,null,"Mexico","BU_MEXICO"]
[null,null,"Mercosur","BU_MERCOSUR"]
[null,"BU Countries"]
[null,"Benelux"]
[]
[]
[]
[]
[null,null,null,null,null,"France"]
[null,"Central Europe"]
[null,null,"Germany"]
[]
[null,null,null,null,null,"Luxemboug"]
[]
[null,null,null,null,null,"The Netherlands"]
[null,"Mexico","Mexico"]
[]
[null,"Italy","Italy"]
[]
[null,"Spain","Spain"]
[]
[null,"Mercosur"]
{"$rows_left_out":169}
{"sheet":"Journal","index":4,"n_rows":2,"n_cols":46,"rows_kept":2,"cut":false,"hidden":true,"merged":[]}
["BUKRS","BLART","BUDAT","BLDAT","XBLNR","WAERS","BKTXT","BUZEI","BSCHL","UMSKZ","KUNNR","LIFNR","HKONT","GSBER","KOSTL","WRBTR","ZUONR","SGTXT","XREF2","NEWBK","ZTERM","BVTYP","ZFBDT","XREF1","LONG_TEXT","MONAT","VBUND","PRCTR","VATDATE","XMWST","KURSF","WWERT","MWSKZ","AUFNR","SEGMENT","XREF3","ZLSCH","HBKID","HKTID","WITHT","QSSKZ","QSSHB","VERTT ","VERTN","MATNR","WERKS"]
["Company Code (4)","Document Type (2)","Posting Date (8)","Document Date (8)","Reference (16)","Currency (3)","Doc. Header Text (25)","Position (3)","Posting Key (2)","SGL Ind (1)","Customer (10)","Vendor (10)","GL Account (10)","Business Area (4)","Cost Center (10)","Amount (13)","Assignment (18)","Text (50)","Reference Key  2 (12)","New Company Code (4)","Payment Terms (4)","Part. Bank (4)","Bline date (8)","Reference Key 1 (12)","Long Text (500)","Period Posting","Trading Partner (6)","Profit Center (6)","VAT Date (8)","Calculate Tax (1)","Rate (5dec)","Traslation Date (8)","Tax Code (2)","Order (12)","Segment (10)","Reference Key 3 (12)","Payment Method (2)","House Bank (5)","Account ID (5)","Withholding Tax Type ()","Withholding Tax Code (2)","Withholding Tax base amount (13)","Contract Type (1)","Contract (13)","Material (18)","Plant (4)"]