{"text_format":"1","workbook":"xlsx","n_sheets":14,"sheets":["cover data","Cover","Creation","MD Companies Centers","Transfer AUC - PO","Capitalization"," Scrapping"," Sale","Transfer","Unplanned Depreciation","Validation","Correction to previuos years ","Leasing","MD"],"not_rendered":{"charts":0,"images":1,"macros":1,"external_links":0,"defined_names":106,"comments":1,"pivot_tables":0},"unopened":[],"bounds":{"document_bytes":16777216,"sheet_cells":100000,"rows_first":2000,"rows_last":500,"rows_between":2000,"halvings":0,"cell_chars":16384,"cell_head_chars":4096},"cells_cut":0,"cells_raw":0,"read":"whole","date_system":"1900"}

{"sheet":"cover data","index":0,"n_rows":550,"n_cols":18,"rows_kept":550,"cut":false,"hidden":true,"merged":[]}
[null,null,null,null,null,null,null,null,null,null,null,"Mandatory","Mandatory"]
[null,null,null,null,null,null,null,null,null,null,null,2,3,27]
[null,null,null,null,null,null,null,null,null,null,null,"BU","Country Name","Nuevo centro SAP","CURRENT Center Name SAP","Hotel or Restaurant (0)/Other(9)","SHARED CENTER SERVICES (YES/NO)","TEMPLATE NAME"]
[null,null,null,null,null,null,null,null,null,null,null,"HESPERIA","ANDORRA","0577","AD01 NH ANDORRA LA VELLA",0,"Y",{"$f":"CONCATENATE(LEFT(O4,4),N4,MID(O4,5,999))","v":"AD010577 NH ANDORRA LA VELLA"}]
["Request",null,"BU","BUSOUTHERN","BUNORTHERN","BUHESPERIA","BUROYAL","BUMERCOSUR","BUMEXICO",null,null,"MERCOSUR","ARGENTINA",9875,"AR01 TREASURY ARGENTINA",9,"Y",{"$f":"CONCATENATE(LEFT(O5,4),N5,MID(O5,5,999))","v":"AR019875 TREASURY ARGENTINA"}]
["Please select",null,"Please select","Please select","Please select","Please select","Please select","Please select","Please select",null,null,"MERCOSUR","ARGENTINA",9883,"AR01 NH WORLD ARGENTINA",9,"Y","AR019883 NH WORLD ARGENTINA"]
["Creation",null,"BU SOUTHERN","SPAIN","NETHERLANDS","ANDORRA","COLOMBIA","ARGENTINA","MEXICO",null,null,"MERCOSUR","ARGENTINA","0164","AR01 NH URBANO",0,"Y","AR010164 NH URBANO"]
["Capitalization",null,"BU NORTHERN","ITALY","GERMANY","SPAIN","CHILE","CHILE",null,null,null,"MERCOSUR","ARGENTINA","0163","AR01 NH PANORAMA",0,"Y","AR010163 NH PANORAMA"]
["Sale",null,"ROYAL","FRANCE","BELGIUM",null,"ECUADOR","URUGUAY",null,null,null,"MERCOSUR","ARGENTINA","0162","AR01 NH LATINO",0,"Y","AR010162 NH LATINO"]
["Transfer",null,"MERCOSUR","PORTUGAL","AUSTRIA",null,"BRASIL",null,null,null,null,"MERCOSUR","ARGENTINA","0161","AR01 NH JOUSTEN",0,"Y","AR010161 NH JOUSTEN"]
{"$rows_left_out":541}
{"sheet":"Cover","index":1,"n_rows":28,"n_cols":4,"rows_kept":28,"cut":false,"hidden":false,"merged":[[17,0,17,1],[3,0,3,9],[5,0,5,2],[6,0,6,2],[7,0,7,2],[8,0,8,2],[10,0,10,2],[11,0,11,1],[12,0,12,1],[13,0,13,1],[14,0,14,1],[15,0,15,1],[28,0,28,8],[18,0,18,1],[19,0,19,1],[22,0,22,1],[24,0,24,1],[27,0,27,1],[27,2,27,8]]}
[]
[null,null,null,"FIXED ASSETS REQUEST FORM"]
[]
["The requestor must fill in the Cover at the beginning, taking into account which fields are mandatory, optional or if SSC Adm. is in charge of completing them"]
[]
["Mandatory fields"]
["Optional fields"]
["   Fields to complete by SSC"]
["Drop down lists / Non-editable fields"]
[]
{"$rows_left_out":19}
{"sheet":"Creation","index":2,"n_rows":59,"n_cols":32,"rows_kept":59,"cut":false,"hidden":false,"merged":[[2,21,2,27]]}
[]
[null,null,null,null,null,null,"ASSET CREATION"]
[]
["*Note"]
["(1) In case the requestor wants to post an invoice against an asset file already created, the requestor must fill in the field Asset number (marked in green colour) informing about the number of the existing asset file in SAP."]
["(2)  In case of Capitalization, when the final asset receives value from the asset under construcction, these fields are not mandatory. The requestor must inform in Comments field, that the asset will be capitalized through asset under construction."]
["(3)  Only fill PORTUGAL"]
[null,null,null,null,null,null,null,null,null,null,null,null,null,null,null,"Book Depr",null,null,"Fiscal Depr"]
["Asset Class","Number of similar asset","FAMA number (Inventory number)*(3)","Quantity","Unit of measurement","Company Code","Hotel Name","B.A","Center (Plant)","Location","Personnel number","Serial number","Evaluation group 2 (3*)","Buildings (Evaluation group 1*)\n*Building where the asset is located","Capitalization Date* \n* The date when the asset must start its depreciation","UseLife  (Years) * Mandatory if the useful life is diferent from SAP","Period (Months)","Deprn Key","UseLife  (Years)","Period (Months)","Deprn Key","Vendor * (2)","Invoice number *(2)","Original Value * (2)","Currency","Tax code","New Fixed Asset (new/used)","Description ","Asset number* (1)","Lock Asset","Delete Asset","Additional Comments from BU"]
[null,null,null,null,null,{"$f":"IF(H10=\"\",\"\",VLOOKUP(H10,'MD Companies Centers'!$A:$C,3,FALSE))","v":""},{"$f":"IF(H10=\"\",\"\",(VLOOKUP(H10,'MD Companies Centers'!$A:$B,2,FALSE)))","v":""},null,{"$f":"IF(H10=\"\",\"\",(VLOOKUP(H10,'MD Companies Centers'!$A:$B,1,FALSE)))","v":""}]
{"$rows_left_out":50}
{"sheet":"MD Companies Centers","index":3,"n_rows":573,"n_cols":5,"rows_kept":573,"cut":false,"hidden":true,"merged":[]}
["*Update based on MD Company Centers v132",null,5,2,3]
["Business Area","CURRENT Center Name SAP","Company Code SAP ","BU","Country Name"]
[9827,"CO01 TREASURY  COLOMBIA","CO01","AMERICA_CO_EC","COLOMBIA"]
[9942,"CO20 COPERAMA COLOMBIA-NH","CO20","COPERAMA","COLOMBIA"]
[9943,"CO20 COPERAMA COLOMBIA-ASOCIAD","CO20","COPERAMA","COLOMBIA"]
[9944,"CO20 COPERAMA COLOMBIA-SSCC","CO20","COPERAMA","COLOMBIA"]
[9505,"DE01 TREASURY GERMANY","DE01","BU NORTHERN","GERMANY"]
[9857,"DE17 COPERAMA CENTRAL EUR-NH","DE17","COPERAMA","GERMANY"]
[9858,"DE17 COPERAMA CE-THIRD PARTY","DE17","COPERAMA","GERMANY"]
[9859,"DE17 COPERAMA CENTRAL EUROPE","DE17","COPERAMA","GERMANY"]
{"$rows_left_out":564}
{"sheet":"Transfer AUC - PO","index":4,"n_rows":123,"n_cols":39,"rows_kept":123,"cut":false,"hidden":false,"merged":[[8,12,9,12],[8,13,9,13],[8,23,9,23],[8,24,9,24],[8,16,8,18],[8,19,8,21],[8,22,9,22],[2,22,2,28],[8,0,9,0],[8,1,9,1],[8,2,9,2],[8,3,9,3],[8,4,9,4],[8,5,9,5],[8,6,9,6],[8,7,9,7],[8,8,9,8],[8,27,9,27],[8,9,9,9],[8,10,9,10],[8,14,9,14],[8,15,9,15],[8,11,9,11],[8,38,9,38],[8,25,9,25],[8,28,9,28],[8,29,9,29],[8,36,9,36],[8,37,9,37],[8,32,9,32],[8,33,9,33],[8,34,9,34],[8,35,9,35],[8,30,9,30],[8,26,9,26]]}
[" "]
[null,null,null,null,null,null,"ASSET TRANSFER PO"]
[]
["*Note"]
["(1) In case the requestor wants to post an invoice against an asset file already created, the requestor must fill in the field Asset number (marked in green colour) informing about the number of the existing asset file in SAP."]
["(2)  In case of Capitalization, when the final asset receives value from the asset under construcction, these fields are mandatory. "]
["(3)  Only fill PORTUGAL"]
[]
["Asset Class","Number of similar asset","Investment Order * (2)","Quantity * (2)","Unit of measurement","Company Code","Hotel Name","B.A","Center (Plant)","Location","Personnel number","Serial number","Evaluation group 2 (3*)","Buildings (Evaluation group 1*)\n*Building where the asset is located","Good Receipt date* (2)\n* The date when the Goods arrived to the hotel","Capitalization Date* \n* The date when the asset must start its depreciation","Book Depr",null,null,"Fiscal Depr",null,null,"Vendor * (2)","Invoice number *(2)","Original Value * (2)","Currency","Tax code","New Fixed Asset (new/used)","Description ","Asset number* (1)","AUC Number - PO","Transfer - Capitalization","Document Date*\n*The day when the document is issued","Posting Date","Asset value date     * depreciation Start","Document number retirement","Lock Asset","Delete Asset","Additional Comments from BU"]
[null,null,null,null,null,null,null,null,null,null,null,null,null,null,null,null,"UseLife  (Years) * Mandatory if the useful life is diferent from SAP","Period (Months)","Deprn Key","UseLife  (Years)","Period (Months)","Deprn Key",null,null,"Amount eur",null,"Amount eur",null,null,null,null,"Amount"]
{"$rows_left_out":114}
{"sheet":"Capitalization","index":5,"n_rows":65,"n_cols":20,"rows_kept":65,"cut":false,"hidden":false,"merged":[[7,19,8,19],[7,4,8,4],[7,18,8,18],[7,6,8,6],[7,7,7,15],[7,17,8,17],[64,0,64,1],[7,3,8,3],[7,5,8,5],[7,0,8,0],[7,16,8,16],[7,2,8,2]]}
[]
[null,null,null,null,null,null,null,"ASSET CAPITALIZATION"]
[]
[]
[]
[]
[]
["AuC Number","Partial capitalization AUC","Currency","Asset Number Receiver","Company Code","Hotel Name","B.A","Replacement Expenses*\n*Fixed Asset responsible must specify the expenses that can be activated",null,null,null,null,null,null,null,null,"Document Date*\n*The day when the document is issued","Posting Date","Capitalization date","Capitalization number"]
[null,"Amount",null,null,null,null,null,"GL Account","Amount","Pst.Key","Currency","CECO","Ref Key 2","Company. Code","Hotel Name","B.A"]
[null,null,null,null,{"$f":"IF(G10=\"\",\"\",VLOOKUP(G10,'MD Companies Centers'!$A:$C,3,FALSE))","v":""},{"$f":"IF(G10=\"\",\"\",(VLOOKUP(G10,'MD Companies Centers'!$A:$B,2,FALSE)))","v":""},null,null,null,null,null,null,null,{"$f":"IF(P10=\"\",\"\",VLOOKUP(P10,'MD Companies Centers'!$A:$C,3,FALSE))","v":""},{"$f":"IF(P10=\"\",\"\",(VLOOKUP(P10,'MD Companies Centers'!$A:$B,2,FALSE)))","v":""}]
{"$rows_left_out":56}
{"sheet":" Scrapping","index":6,"n_rows":118,"n_cols":25,"rows_kept":118,"cut":false,"hidden":false,"merged":[[8,2,9,2],[8,4,9,4],[8,13,9,13],[8,1,9,1],[8,8,9,8],[8,24,9,24],[102,24,103,24],[8,3,9,3],[102,3,103,3],[8,21,9,21],[8,22,9,22],[8,23,9,23],[8,5,9,5],[8,6,9,6],[8,7,9,7],[2,21,5,23],[102,22,103,22],[102,23,103,23],[102,21,103,21],[102,15,102,19],[102,20,103,20],[2,15,5,19],[6,0,6,1],[8,0,9,0],[102,9,102,11],[102,13,103,13],[8,14,9,14],[102,14,103,14],[102,5,103,5],[102,8,103,8],[102,1,103,1],[102,2,103,2],[102,4,103,4],[8,9,9,9],[8,10,9,10],[8,11,9,11],[8,12,9,12],[102,0,103,0]]}
[]
[null,null,null,null,null,null,null,null,"ASSET RETIREMENT BY SCRAPPING"]
[]
["*Note"]
["(1) and (2) This field is only mandatory for BU Italy for TAX purposes. "]
[]
["0 € ≤  NBV ≤ 5.000 €",null,null,"Authorizations","Hotel/CS Deparment Director",null,"Date:_________","Fixed Assets Responsible",null,"Date:_________"]
[]
["Asset number","Asset Description","Company Code","Hotel Name","B.A","Quantity","Date of Acquisition","Original Cost","NBV \n(Net book value)","Partial retirement*\n* Fill in only one of the fields (% and quantity or amount and quantity)","Quantity","Amount","Currency","Waste Certificate (Formulario Rifiuti) *(1)","Document of Transport number (DDT) *(2)","Sap Manual Journal",null,null,null,null,"Transaction Type","Document Date*\n*The day when the document is issued","Posting Date","Asset value date*\n*Deadline of depreciation before the scrapping","Asset scrapping number"]
[null,null,null,null,null,null,null,null,null,null,null,null,null,null,null,"Cost of disposal","Cost Center","Sap Account Number","DR","CR"]
{"$rows_left_out":109}
{"sheet":" Sale","index":7,"n_rows":124,"n_cols":27,"rows_kept":124,"cut":false,"hidden":false,"merged":[[9,18,9,21],[90,22,91,22],[44,0,44,1],[46,0,47,0],[46,1,47,1],[79,0,79,1],[80,0,80,1],[90,19,90,21],[90,16,90,18],[46,6,47,6],[46,22,47,22],[46,18,46,21],[9,3,10,3],[9,4,10,4],[9,5,10,5],[123,2,123,12],[124,0,124,12],[79,2,79,10],[46,2,47,2],[123,0,123,1],[81,0,81,1],[81,2,81,10],[87,0,87,1],[80,2,80,10],[46,3,47,3],[46,4,47,4],[46,5,47,5],[46,24,47,24],[46,25,47,25],[46,23,47,23],[46,7,47,7],[46,8,47,8],[90,23,91,24],[2,28,3,33],[7,0,7,1],[9,1,10,1],[9,2,10,2],[9,0,10,0],[9,6,10,6],[9,23,10,23],[9,24,10,24],[9,25,10,25],[9,26,10,26],[9,7,10,7],[9,8,10,8],[9,9,9,17],[9,22,10,22],[46,26,47,26]]}
[]
[null,null,null,null,null,null,null,null,"ASSET RETIREMENT BY SALE"]
[]
["*Note"]
["(1) This field is only mandatory for BU Italy for TAX purposes. This number must be included in the invoice created for the asset sale"]
["(2) This field is only applicable for BU COLOMBIA"]
[]
["0 € ≤  NBV ≤ 5.000 €",null,null,"Authorizations","Hotel/CS Deparment Director",null,"Date:_________","Fixed Assets Responsible",null,"Date:_________"]
[]
["Asset number","Asset Description","Quantity","Company Code","Hotel Name","B.A","Date of Acquisition","Original Cost","NBV \n(Net book value)","Customer/ Company Group Destination",null,null,null,null,null,null,null,null,"Partial retirement*\n* Fill in only one of the fields (% and quantity or amount and quantity)",null,null,null,"Document of Transport number (DDT) *(1)","Document Date*\n*The day when the document is issued","Posting Date","Asset value date*\n*Deadline of depreciation before the sale","Document number retirement"]
{"$rows_left_out":115}
{"sheet":"Transfer","index":8,"n_rows":121,"n_cols":23,"rows_kept":121,"cut":false,"hidden":false,"merged":[[121,0,121,15],[77,2,77,11],[8,16,9,16],[44,16,45,16],[8,3,9,3],[8,4,9,4],[8,5,9,5],[44,3,45,3],[44,4,45,4],[44,5,45,5],[44,13,45,13],[44,14,45,14],[44,15,45,15],[8,13,9,13],[44,9,44,11],[42,0,42,1],[2,22,3,27],[6,0,6,1],[8,1,9,1],[8,14,9,14],[8,2,9,2],[8,0,9,0],[8,6,9,6],[8,7,9,7],[8,8,9,8],[8,15,9,15],[8,9,8,12],[44,7,45,7],[44,8,45,8],[77,0,77,1],[120,0,120,1],[120,2,120,15],[44,1,45,1],[44,2,45,2],[44,0,45,0],[44,6,45,6],[86,15,86,17],[86,18,86,20],[86,21,87,21],[86,22,87,23],[78,0,78,1],[78,2,78,10],[84,0,84,1]]}
[]
[null,null,null,null,null,null,null,null,"ASSET RETIREMENT BY TRANSFER"]
[]
[]
[]
[]
["0 € ≤  NBV ≤ 5.000 €",null,null,"Authorizations","Hotel/CS Deparment Director",null,"Date:_________","Fixed Assets Responsible",null,"Date:_________"]
[]
["Asset number","Asset Description","Quantity","Company Code","Hotel Name","B.A","Date of Acquisition","Cost","NBV \n(Net book value)","Partial retirement*\n* Fill in only one of the fields (%, and quantity or amount and quantity)",null,null,null,"Document Date*\n*The day when the document is issued","Posting Date","Asset value date*\n*Deadline of depreciation before the sale","Document number retirement"]
[null,null,null,null,null,null,null,null,null,"%","Quantity","Amount","Currency"]
{"$rows_left_out":112}
{"sheet":"Unplanned Depreciation","index":9,"n_rows":46,"n_cols":17,"rows_kept":46,"cut":false,"hidden":false,"merged":[[3,20,4,27],[7,0,8,0],[7,12,8,12],[7,13,8,13],[7,14,8,14],[7,15,8,15],[7,16,8,16],[7,1,8,1],[7,2,8,2],[7,3,8,3],[7,4,7,6],[7,11,8,11],[7,9,8,9],[7,8,8,8],[7,10,8,10],[45,2,45,13],[45,0,45,1]]}
[]
[null,null,null,null,null,null,null,null,null,null,null,null,"UNPLANNED DEPRECIATION"]
[]
[]
[]
[]
[]
["Asset Number","Company Code","Hotel Name","B.A","Partial impairment*\n* Fill in only one of the fields (%, quantity or amount)",null,null,null,"PstKey","Unplanned book depraciation Value","PstKey","Unplanned Fiscal Depreciation Value","Description","Sap Doc. Number","Document Date*\n*The day when the document is issued","Posting Date","Asset value date*\n*Deadline of depreciation before the sale"]
[null,null,null,null,"%","Quantity","Amount","Currency"]
[null,null,null,null,null,null,null,null,null,null,"Please select"]
{"$rows_left_out":37}
{"sheet":"Validation","index":10,"n_rows":8,"n_cols":4,"rows_kept":8,"cut":false,"hidden":false,"merged":[[2,0,4,0]]}
[]
["Validation Type","Validation Description","Colour error code","Error Message"]
["Capitalization date","It is mandatory to fill","RED","N/A"]
[null,"It should be the last day of the month","Warning","It is mandatory to insert a valid End of month date"]
[null,"It should be indicated following dd/mm/yyyy format","Warning","It is mandatory to insert a valid End of month date"]
["Posting date","Change automatically","N/A","N/A"]
["Document date","Change automatically","N/A","N/A"]
["AUC number-PO","Ordered automatically by capitalization date","N/A","N/A"]

{"sheet":"Correction to previuos years ","index":11,"n_rows":48,"n_cols":17,"rows_kept":48,"cut":false,"hidden":false,"merged":[[3,20,4,27],[7,0,8,0],[7,9,8,9],[7,13,8,13],[7,14,8,14],[7,15,8,15],[7,16,8,16],[7,1,8,1],[7,2,8,2],[7,3,8,3],[7,4,7,6],[7,10,8,10],[7,11,8,11],[7,12,8,12],[7,8,8,8],[47,0,47,1],[47,2,47,13]]}
[]
[null,null,null,null,null,null,null,null," CORRECTION DUE TO AN EXCESS DEPRECIATION IN PREVIOUS YEARS"]
[]
[]
[]
[]
[]
["Asset Number","Company Code","Hotel Name","B.A","Partial impairment*\n* Fill in only one of the fields (%, quantity or amount)",null,null,null,"PstKey","Unplanned book depraciation Value","PstKey","Unplanned Fiscal Depreciation Value","Description","Sap Doc. Number","Document Date*\n*The day when the document is issued","Posting Date","Asset value date*\n*Deadline of depreciation before the correction"]
[null,null,null,null,"%","Quantity","Amount","Currency"]
[null,{"$f":"IF(D10=\"\",\"\",VLOOKUP(D10,'MD Companies Centers'!$A:$C,3,FALSE))","v":""},{"$f":"IF(D10=\"\",\"\",(VLOOKUP(D10,'MD Companies Centers'!$A:$B,2,FALSE)))","v":""}]
{"$rows_left_out":39}
{"sheet":"Leasing","index":12,"n_rows":62,"n_cols":27,"rows_kept":62,"cut":false,"hidden":false,"merged":[[7,25,8,25],[7,26,8,26],[7,22,8,22],[7,24,8,24],[7,4,8,4],[7,6,8,6],[7,8,8,8],[7,14,8,14],[7,9,8,9],[7,16,8,16],[7,20,8,20],[7,5,8,5],[7,10,8,10],[7,21,8,21],[7,11,8,11],[7,12,8,12],[61,0,61,1],[7,7,8,7],[6,0,6,2],[7,0,8,0],[7,1,8,1],[7,2,8,2],[7,3,8,3],[61,2,61,21],[7,13,8,13],[7,23,8,23],[2,13,3,18],[7,15,8,15],[7,18,8,18],[7,19,8,19]]}
[]
[null,null,null,null,null,null,null,"LEASING"]
[]
[]
[]
["(1) FAMA number is not mandatory for requests belonging to GIHSA and BU Benelux"]
[]
["Asset Class","Number of similar asset","FAMA number (Inventory number)*(1)","Quantity","Unit of measurement","Company Code","Hotel Name","B.A.","Center (Plant)","Location","Personnel number","Serial number","License plate","Buildings (Evaluation group 1*)\n*Building where the asset is located","Vendor","Invoice number","Original Value",null,"New Fixed Asset (new/used)","Description ","Initial quote Amount","Agreement time period","Asset number","Leasing company","Agreement number","Agreement date","Lease start date"]
[null,null,null,null,null,null,null,null,null,null,null,null,null,null,null,null,null,"Currency"]
[null,null,null,null,"ST-Piece",{"$f":"IF(H10=\"\",\"\",VLOOKUP(H10,'MD Companies Centers'!$A:$C,3,FALSE))","v":""},{"$f":"IF(H10=\"\",\"\",(VLOOKUP(H10,'MD Companies Centers'!$A:$B,2,FALSE)))","v":""},null,{"$f":"G10","v":""}]
{"$rows_left_out":53}
{"sheet":"MD","index":13,"n_rows":87,"n_cols":13,"rows_kept":87,"cut":false,"hidden":false,"merged":[]}
["Please select",null,"Please select",null,null,"Please select",null,"Book Depreciation","Fiscal depreciation",null,"Please select",null,"Please select"]
["2110001 CONCESSIONS AND LICENCES",null,"AIRCONDITION",null,null,"BU01",null,"Please select","Please select",null,"KI-Crate",null,"new "]
["2120001 PATENTS, TRADEMARKS AND KNOW HOW",null,"BACK OFFICE",null,null,"BU02",null,"ZNH0-MONTH + 1","ZNH0-MONTH + 1",null,"CS-Case",null,"used"]
["2130001 GOODWILL OF MERGER",null,"BANQUETING",null,null,"BU03",null,"ZNH1-NO DEPRECIATION","ZNH1-NO DEPRECIATION",null,"TAG-Days"]
["2140001 RIGHTS OF BENEFICIAL USE",null,"BAR",null,null,"BU04",null,null,"ZNH3-MONTH",null,"STD-Hours"]
["2150001 SOFTWARE",null,"BASEMENT",null,null,"BU05",null,null,"ZNHI-JULY CONVENTION (ITALY)",null,"KG-Kilogram"]
["2160001 LEASE AGREEMENTS CAPITALISATION RENTS PREMIUM",null,"BREAKFAST ROOM",null,null,"BU06",null,null,null,null,"L-Liter"]
["2200001 LAND",null,"BUFFET",null,null,"BU07",null,null,null,null,"M2-Square meter"]
["2210001 BUILDINGS DEMOLITION AND EXCAVATION",null,"BUSINESS CENTER",null,null,"BU08",null,null,null,null,"MON-Months"]
["2210002 BUILDINGS FOUNDATION AND STRUCTURE",null,"CENTRAL SERVICES",null,null,"BU09",null,null,null,null,"ST-Piece"]
{"$rows_left_out":77}